{"text_format":"1","workbook":"xlsx","n_sheets":15,"sheets":["MATRICULA","APROV 1","Gráfica APROV 1","R1","Gráfica R1","APROV 2","Gráfica APROV 2","R2","Gráfica R2","APROV 3","Gráfica APROV 3","R3","Gráfica R3","Gráfica Promedios Finales","NORMALIDAD MÍNIMA"],"not_rendered":{"charts":7,"images":1,"macros":1,"external_links":2,"defined_names":8,"comments":0,"pivot_tables":0},"unopened":[],"bounds":{"document_bytes":16777216,"sheet_cells":100000,"rows_first":2000,"rows_last":500,"rows_between":2000,"halvings":0,"cell_chars":16384,"cell_head_chars":4096},"cells_cut":0,"cells_raw":0,"read":"whole","date_system":"1900"}

{"sheet":"MATRICULA","index":0,"n_rows":34,"n_cols":38,"rows_kept":34,"cut":false,"hidden":false,"merged":[[11,32,11,33],[11,1,12,7],[24,1,27,1],[24,2,24,25],[13,1,16,1],[13,2,13,25],[26,2,26,4],[26,5,26,7],[14,2,14,13],[14,14,14,25],[15,2,15,4],[15,5,15,7],[15,8,15,10],[15,11,15,13],[24,26,25,37],[25,2,25,13],[25,14,25,25],[15,17,15,19],[15,20,15,22],[26,35,26,37],[26,8,26,10],[26,11,26,13],[26,14,26,16],[26,17,26,19],[26,20,26,22],[26,23,26,25],[26,26,26,28],[26,29,26,31],[26,32,26,34],[15,23,15,25],[1,2,1,30],[2,2,2,30],[4,2,4,30],[7,2,7,13],[7,14,7,26],[6,2,6,13],[6,14,6,26],[10,8,10,26],[10,1,10,7],[15,14,15,16],[11,8,11,26],[11,27,11,31]]}
[]
[null,null,"Secretaría de Educación Pública del Estado de Baja California Sur"]
[null,null,"Dirección de Educación Secundaria"]
[]
[null,null,"MATRÍCULA"]
[]
[null,null,"PERIODO DE EVALUACIÓN:",null,null,null,null,null,null,null,null,null,null,null,"CONCENTRADO CIERRE CICLO ESCOLAR"]
[null,null,"CICLO ESCOLAR :",null,null,null,null,null,null,null,null,null,null,null,"2022-2023"]
[]
[]
[null,null,null,null,null,null,null,null,"MTRA. OFELIA ELIZABETH OCHOA ROMERO"]
[null,null,null,null,null,null,null,null,"DIRECCIÓN DE EDUCACIÓN SECUNDARIA"]
[]
[null,"MODALIDAD","MATRÍCULA"]
[null,null,"INSCRIPCIÓN INICIAL ",null,null,null,null,null,null,null,null,null,null,null,"CAMBIOS DESDE OTRAS ESCUELAS (ALTAS)"]
[null,null,"PRIMERO",null,null,"SEGUNDO",null,null,"TERCERO",null,null,"TOTAL",null,null,"PRIMERO",null,null,"SEGUNDO",null,null,"TERCERO",null,null,"TOTAL"]
[null,null,"H","M","T","H","M","T","H","M","T","H","M","T","H","M","T","H","M","T","H","M","T","H","M","T"]
[null,"GENERALES PÚBLICAS",2887,2808,{"$f":"C18+D18","v":5695},2813,2706,{"$f":"F18+G18","v":5519},2785,2874,{"$f":"I18+J18","v":5659},{"$f":"C18+F18+I18","v":8485},{"$f":"D18+G18+J18","v":8388},{"$f":"L18+M18","v":16873},115,97,{"$f":"O18+P18","v":212},79,124,{"$f":"R18+S18","v":203},61,86,{"$f":"U18+V18","v":147},{"$f":"O18+R18+U18","v":255},{"$f":"P18+S18+V18","v":307},{"$f":"X18+Y18","v":562}]
[null,"GENERALES PARTICULARES",798,756,{"$f":"C19+D19","v":1554},631,649,{"$f":"F19+G19","v":1280},590,631,{"$f":"I19+J19","v":1221},{"$f":"C19+F19+I19","v":2019},{"$f":"D19+G19+J19","v":2036},{"$f":"L19+M19","v":4055},41,34,{"$f":"O19+P19","v":75},27,33,{"$f":"R19+S19","v":60},17,17,{"$f":"U19+V19","v":34},{"$f":"O19+R19+U19","v":85},{"$f":"P19+S19+V19","v":84},{"$f":"X19+Y19","v":169}]
[null,"SEC TÉCNICAS",2571,2549,{"$f":"IF(SUM(C20,D20)=0,\"\",SUM(C20,D20))","v":5120},2582,2533,{"$f":"IF(SUM(F20,G20)=0,\"\",SUM(F20,G20))","v":5115},2540,2533,{"$f":"IF(SUM(I20,J20)=0,\"\",SUM(I20,J20))","v":5073},{"$f":"IF(SUM(C20,F20,I20)=0,\"\",SUM(C20,F20,I20))","v":7693},{"$f":"IF(SUM(D20,G20,J20)=0,\"\",SUM(SUM(D20,G20,J20)))","v":7615},{"$f":"IF(SUM(L20,M20)=0,\"\",SUM(L20,M20))","v":15308},102,96,{"$f":"IF(SUM(O20,P20)=0,\"\",SUM(O20,P20))","v":198},89,97,{"$f":"IF(SUM(R20,S20)=0,\"\",SUM(R20,S20))","v":186},40,70,{"$f":"IF(SUM(U20,V20)=0,\"\",SUM(U20,V20))","v":110},{"$f":"IF(SUM(O20,R20,U20)=0,\"\",SUM(O20,R20,U20))","v":231},{"$f":"IF(SUM(P20,S20,V20)=0,\"\",SUM(SUM(P20,S20,V20)))","v":263},{"$f":"IF(SUM(X20,Y20)=0,\"\",SUM(X20,Y20))","v":494}]
[null,"TELESECUNDARIAS",935,774,{"$f":"IF(SUM(C21,D21)=0,\"\",SUM(C21,D21))","v":1709},925,802,{"$f":"IF(SUM(F21,G21)=0,\"\",SUM(F21,G21))","v":1727},840,748,{"$f":"IF(SUM(I21,J21)=0,\"\",SUM(I21,J21))","v":1588},{"$f":"IF(SUM(C21,F21,I21)=0,\"\",SUM(C21,F21,I21))","v":2700},{"$f":"IF(SUM(D21,G21,J21)=0,\"\",SUM(SUM(D21,G21,J21)))","v":2324},{"$f":"IF(SUM(L21,M21)=0,\"\",SUM(L21,M21))","v":5024},50,40,{"$f":"IF(SUM(O21,P21)=0,\"\",SUM(O21,P21))","v":90},39,51,{"$f":"IF(SUM(R21,S21)=0,\"\",SUM(R21,S21))","v":90},31,38,{"$f":"IF(SUM(U21,V21)=0,\"\",SUM(U21,V21))","v":69},{"$f":"IF(SUM(O21,R21,U21)=0,\"\",SUM(O21,R21,U21))","v":120},{"$f":"IF(SUM(P21,S21,V21)=0,\"\",SUM(SUM(P21,S21,V21)))","v":129},{"$f":"IF(SUM(X21,Y21)=0,\"\",SUM(X21,Y21))","v":249}]
[null,null,null,null,{"$f":"IF(SUM(C22,D22)=0,\"\",SUM(C22,D22))","v":""},null,null,{"$f":"IF(SUM(F22,G22)=0,\"\",SUM(F22,G22))","v":""},null,null,{"$f":"IF(SUM(I22,J22)=0,\"\",SUM(I22,J22))","v":""},{"$f":"IF(SUM(C22,F22,I22)=0,\"\",SUM(C22,F22,I22))","v":""},{"$f":"IF(SUM(D22,G22,J22)=0,\"\",SUM(SUM(D22,G22,J22)))","v":""},{"$f":"IF(SUM(L22,M22)=0,\"\",SUM(L22,M22))","v":""},null,null,{"$f":"IF(SUM(O22,P22)=0,\"\",SUM(O22,P22))","v":""},null,null,{"$f":"IF(SUM(R22,S22)=0,\"\",SUM(R22,S22))","v":""},null,null,{"$f":"IF(SUM(U22,V22)=0,\"\",SUM(U22,V22))","v":""},{"$f":"IF(SUM(O22,R22,U22)=0,\"\",SUM(O22,R22,U22))","v":""},{"$f":"IF(SUM(P22,S22,V22)=0,\"\",SUM(SUM(P22,S22,V22)))","v":""},{"$f":"IF(SUM(X22,Y22)=0,\"\",SUM(X22,Y22))","v":""}]
[null,"TOTAL",{"$f":"IF(SUM(C18:C22)=0,\"\",SUM(C18:C22))","v":7191},6887,14078,6951,6690,13641,6755,6786,13541,20897,20363,41260,308,267,575,234,305,539,149,211,360,691,783,1474]
[]
[null,"MODALIDAD","BAJAS",null,null,null,null,null,null,null,null,null,null,null,null,null,null,null,null,null,null,null,null,null,null,null,"EXISTENCIA"]
[null,null,"DESERCIÓN",null,null,null,null,null,null,null,null,null,null,null,"CAMBIOS HACIA OTRAS ESCUELAS (TRASLADOS)"]
[null,null,"PRIMERO",null,null,"SEGUNDO",null,null,"TERCERO",null,null,"TOTAL",null,null,"PRIMERO",null,null,"SEGUNDO",null,null,"TERCERO",null,null,"TOTAL",null,null,"PRIMERO",null,null,"SEGUNDO",null,null,"TERCERO",null,null,"TOTAL"]
[null,null,"H","M","T","H","M","T","H","M","T","H","M","T","H","M","T","H","M","T","H","M","T","H","M","T","H","M","T","H","M","T","H","M","T","H","M","T"]
[null,{"$f":"IF(B18=0,\"\",B18)","v":"GENERALES PÚBLICAS"},4,3,{"$f":"C29+D29","v":7},4,8,{"$f":"F29+G29","v":12},22,17,{"$f":"I29+J29","v":39},{"$f":"C29+F29+I29","v":30},{"$f":"D29+G29+J29","v":28},{"$f":"L29+M29","v":58},132,111,{"$f":"O29+P29","v":243},132,140,{"$f":"R29+S29","v":272},96,88,{"$f":"U29+V29","v":184},{"$f":"O29+R29+U29","v":360},{"$f":"P29+S29+V29","v":339},{"$f":"X29+Y29","v":699},{"$f":"C18+O18-C29-O29","v":2866},{"$f":"D18+P18-D29-P29","v":2791},{"$f":"AA29+AB29","v":5657},{"$f":"F18+R18-F29-R29","v":2756},{"$f":"G18+S18-G29-S29","v":2682},{"$f":"AD29+AE29","v":5438},{"$f":"I18+U18-I29-U29","v":2728},{"$f":"J18+V18-J29-V29","v":2855},{"$f":"AG29+AH29","v":5583},{"$f":"AA29+AD29+AG29","v":8350},{"$f":"AB29+AE29+AH29","v":8328},{"$f":"AJ29+AK29","v":16678}]
[null,{"$f":"IF(B19=0,\"\",B19)","v":"GENERALES PARTICULARES"},8,3,{"$f":"C30+D30","v":11},6,2,{"$f":"F30+G30","v":8},1,2,{"$f":"I30+J30","v":3},{"$f":"C30+F30+I30","v":15},{"$f":"D30+G30+J30","v":7},{"$f":"L30+M30","v":22},14,13,{"$f":"O30+P30","v":27},16,22,{"$f":"R30+S30","v":38},6,16,{"$f":"U30+V30","v":22},{"$f":"O30+R30+U30","v":36},{"$f":"P30+S30+V30","v":51},{"$f":"X30+Y30","v":87},{"$f":"C19+O19-C30-O30","v":817},{"$f":"D19+P19-D30-P30","v":774},{"$f":"AA30+AB30","v":1591},{"$f":"F19+R19-F30-R30","v":636},{"$f":"G19+S19-G30-S30","v":658},{"$f":"AD30+AE30","v":1294},{"$f":"I19+U19-I30-U30","v":600},{"$f":"J19+V19-J30-V30","v":630},1231,{"$f":"AA30+AD30+AG30","v":2053},{"$f":"AB30+AE30+AH30","v":2062},{"$f":"AJ30+AK30","v":4115}]
[null,{"$f":"IF(B20=0,\"\",B20)","v":"SEC TÉCNICAS"},15,10,{"$f":"IF(SUM(C31,D31)=0,\"\",SUM(C31,D31))","v":25},16,15,{"$f":"IF(SUM(F31,G31)=0,\"\",SUM(F31,G31))","v":31},12,14,{"$f":"IF(SUM(I31,J31)=0,\"\",SUM(I31,J31))","v":26},{"$f":"IF(SUM(C31,F31,I31)=0,\"\",SUM(C31,F31,I31))","v":43},{"$f":"IF(SUM(D31,G31,J31)=0,\"\",SUM(SUM(D31,G31,J31)))","v":39},{"$f":"IF(SUM(L31,M31)=0,\"\",SUM(L31,M31))","v":82},93,96,{"$f":"IF(SUM(O31,P31)=0,\"\",SUM(O31,P31))","v":189},89,97,{"$f":"IF(SUM(R31,S31)=0,\"\",SUM(R31,S31))","v":186},53,60,{"$f":"IF(SUM(U31,V31)=0,\"\",SUM(U31,V31))","v":113},{"$f":"IF(SUM(O31,R31,U31)=0,\"\",SUM(O31,R31,U31))","v":235},{"$f":"IF(SUM(P31,S31,V31)=0,\"\",SUM(SUM(P31,S31,V31)))","v":253},{"$f":"IF(SUM(X31,Y31)=0,\"\",SUM(X31,Y31))","v":488},{"$f":"IF(SUM(C20,O20-C31-O31)=0,\"\",SUM(C20,O20-C31-O31))","v":2565},2539,{"$f":"IF(SUM(AA31,AB31)=0,\"\",SUM(AA31,AB31))","v":5104},{"$f":"IF(SUM(F20,R20-F31-R31)=0,\"\",SUM(F20,R20-F31-R31))","v":2566},2518,{"$f":"IF(SUM(AD31,AE31)=0,\"\",SUM(AD31,AE31))","v":5084},{"$f":"IF(SUM(I20,U20-I31-U31)=0,\"\",SUM(I20,U20-I31-U31))","v":2515},2529,{"$f":"IF(SUM(AG31,AH31)=0,\"\",SUM(AG31,AH31))","v":5044},{"$f":"IF(SUM(AA31,AD31,AG31)=0,\"\",SUM(AA31,AD31,AG31))","v":7646},{"$f":"IF(SUM(AB31,AE31,AH31)=0,\"\",SUM(SUM(AB31,AE31,AH31)))","v":7586},{"$f":"IF(SUM(AJ31,AK31)=0,\"\",SUM(AJ31,AK31))","v":15232}]
[null,{"$f":"IF(B21=0,\"\",B21)","v":"TELESECUNDARIAS"},4,5,{"$f":"IF(SUM(C32,D32)=0,\"\",SUM(C32,D32))","v":9},10,7,{"$f":"IF(SUM(F32,G32)=0,\"\",SUM(F32,G32))","v":17},8,6,{"$f":"IF(SUM(I32,J32)=0,\"\",SUM(I32,J32))","v":14},{"$f":"IF(SUM(C32,F32,I32)=0,\"\",SUM(C32,F32,I32))","v":22},{"$f":"IF(SUM(D32,G32,J32)=0,\"\",SUM(SUM(D32,G32,J32)))","v":18},{"$f":"IF(SUM(L32,M32)=0,\"\",SUM(L32,M32))","v":40},45,33,{"$f":"IF(SUM(O32,P32)=0,\"\",SUM(O32,P32))","v":78},38,39,{"$f":"IF(SUM(R32,S32)=0,\"\",SUM(R32,S32))","v":77},32,24,{"$f":"IF(SUM(U32,V32)=0,\"\",SUM(U32,V32))","v":56},{"$f":"IF(SUM(O32,R32,U32)=0,\"\",SUM(O32,R32,U32))","v":115},{"$f":"IF(SUM(P32,S32,V32)=0,\"\",SUM(SUM(P32,S32,V32)))","v":96},{"$f":"IF(SUM(X32,Y32)=0,\"\",SUM(X32,Y32))","v":211},936,776,{"$f":"IF(SUM(AA32,AB32)=0,\"\",SUM(AA32,AB32))","v":1712},916,807,{"$f":"IF(SUM(AD32,AE32)=0,\"\",SUM(AD32,AE32))","v":1723},831,756,{"$f":"IF(SUM(AG32,AH32)=0,\"\",SUM(AG32,AH32))","v":1587},{"$f":"IF(SUM(AA32,AD32,AG32)=0,\"\",SUM(AA32,AD32,AG32))","v":2683},{"$f":"IF(SUM(AB32,AE32,AH32)=0,\"\",SUM(SUM(AB32,AE32,AH32)))","v":2339},{"$f":"IF(SUM(AJ32,AK32)=0,\"\",SUM(AJ32,AK32))","v":5022}]
[null,{"$f":"IF(B22=0,\"\",B22)","v":""},null,null,{"$f":"IF(SUM(C33,D33)=0,\"\",SUM(C33,D33))","v":""},null,null,{"$f":"IF(SUM(F33,G33)=0,\"\",SUM(F33,G33))","v":""},null,null,{"$f":"IF(SUM(I33,J33)=0,\"\",SUM(I33,J33))","v":""},{"$f":"IF(SUM(C33,F33,I33)=0,\"\",SUM(C33,F33,I33))","v":""},{"$f":"IF(SUM(D33,G33,J33)=0,\"\",SUM(SUM(D33,G33,J33)))","v":""},{"$f":"IF(SUM(L33,M33)=0,\"\",SUM(L33,M33))","v":""},null,null,{"$f":"IF(SUM(O33,P33)=0,\"\",SUM(O33,P33))","v":""},null,null,{"$f":"IF(SUM(R33,S33)=0,\"\",SUM(R33,S33))","v":""},null,null,{"$f":"IF(SUM(U33,V33)=0,\"\",SUM(U33,V33))","v":""},{"$f":"IF(SUM(O33,R33,U33)=0,\"\",SUM(O33,R33,U33))","v":""},{"$f":"IF(SUM(P33,S33,V33)=0,\"\",SUM(SUM(P33,S33,V33)))","v":""},{"$f":"IF(SUM(X33,Y33)=0,\"\",SUM(X33,Y33))","v":""},"","",{"$f":"IF(SUM(AA33,AB33)=0,\"\",SUM(AA33,AB33))","v":""},"","",{"$f":"IF(SUM(AD33,AE33)=0,\"\",SUM(AD33,AE33))","v":""},"","",{"$f":"IF(SUM(AG33,AH33)=0,\"\",SUM(AG33,AH33))","v":""},{"$f":"IF(SUM(AA33,AD33,AG33)=0,\"\",SUM(AA33,AD33,AG33))","v":""},{"$f":"IF(SUM(AB33,AE33,AH33)=0,\"\",SUM(SUM(AB33,AE33,AH33)))","v":""},{"$f":"IF(SUM(AJ33,AK33)=0,\"\",SUM(AJ33,AK33))","v":""}]
[null,"TOTAL",{"$f":"IF(SUM(C29:C33)=0,\"\",SUM(C29:C33))","v":31},21,52,36,32,68,43,39,82,110,92,202,284,253,537,275,298,573,187,188,375,746,739,1485,7184,6880,14064,6874,6665,13539,6674,6770,13445,20732,20315,41047]

{"sheet":"APROV 1","index":1,"n_rows":33,"n_cols":34,"rows_kept":33,"cut":false,"hidden":false,"merged":[[32,0,34,33],[23,2,23,4],[23,5,23,7],[23,8,23,10],[23,17,23,19],[23,23,23,25],[20,2,20,4],[20,8,20,10],[20,5,20,7],[22,26,22,31],[22,0,22,25],[20,29,20,31],[20,11,20,13],[20,14,20,16],[20,17,20,19],[20,20,20,22],[20,26,20,28],[20,23,20,25],[30,0,30,1],[20,32,20,33],[22,32,23,33],[23,0,24,1],[25,0,25,1],[26,0,26,1],[9,5,9,24],[10,5,10,25],[6,2,6,13],[7,2,7,13],[6,14,6,26],[7,14,7,26],[14,5,14,7],[12,26,12,31],[14,23,14,25],[14,20,14,22],[10,27,10,31],[12,0,12,25],[14,8,14,10],[13,20,13,22],[14,2,14,4],[14,11,14,13],[13,29,13,31],[14,29,14,31],[13,26,13,28],[14,26,14,28],[13,23,13,25],[14,32,14,33],[13,0,14,0],[13,2,13,4],[17,8,17,10],[19,32,19,33],[19,8,19,10],[19,11,19,13],[19,14,19,16],[19,17,19,19],[19,20,19,22],[19,23,19,25],[19,26,19,28],[17,11,17,13],[15,14,15,16],[13,5,13,7],[13,8,13,10],[13,11,13,13],[13,14,13,16],[13,17,13,19],[14,17,14,19],[14,14,14,16],[16,5,16,7],[16,14,16,16],[16,17,16,19],[0,0,0,33],[2,2,2,30],[3,2,3,30],[4,2,4,30],[5,2,5,30],[10,0,10,3],[17,29,17,31],[17,32,17,33],[18,2,18,4],[18,5,18,7],[18,8,18,10],[15,2,15,4],[15,5,15,7],[15,8,15,10],[15,11,15,13],[18,20,18,22],[18,23,18,25],[18,26,18,28],[18,11,18,13],[12,32,13,33],[18,32,18,33],[16,8,16,10],[16,11,16,13],[9,0,9,3],[36,0,63,33],[18,29,18,31],[23,29,23,31],[23,11,23,13],[23,14,23,16],[23,20,23,22],[23,26,23,28],[15,29,15,31],[17,5,17,7],[16,2,16,4],[16,20,16,22],[16,23,16,25],[16,26,16,28],[15,26,15,28],[15,17,15,19],[15,20,15,22],[15,23,15,25],[17,14,17,16],[17,17,17,19],[17,20,17,22],[17,23,17,25],[17,26,17,28],[18,14,18,16],[18,17,18,19],[27,0,27,1],[28,0,28,1],[29,0,29,1],[17,2,17,4],[15,32,15,33],[16,29,16,31],[16,32,16,33],[19,2,19,4],[19,5,19,7],[19,29,19,31]]}
[]
[]
[null,null,"Secretaría de Educación Pública del Estado de Baja California Sur"]
[null,null,"Dirección de Educación Secundaria"]
[null,null,"APROVECHAMIENTO Y RIESGO DE NO ACREDITAR"]
[null,null,"PRIMER GRADO "]
[null,null,"PERIODO EVALUACIÓN:",null,null,null,null,null,null,null,null,null,null,null,{"$f":"IF(MATRICULA!O7=0,\"\",MATRICULA!O7)","v":"CONCENTRADO CIERRE CICLO ESCOLAR"}]
[null,null,"CICLO ESCOLAR :",null,null,null,null,null,null,null,null,null,null,null,{"$f":"IF(MATRICULA!O8=0,\"\",MATRICULA!O8)","v":"2022-2023"}]
[]
[null,null,null,null,null,{"$f":"MATRICULA!I11","v":"MTRA. OFELIA ELIZABETH OCHOA ROMERO"}]
[null,null,null,null,null,{"$f":"MATRICULA!I12","v":"DIRECCIÓN DE EDUCACIÓN SECUNDARIA"}]
[]
["Promedio de Aprovechamiento de los Campos de Formación Académica",null,null,null,null,null,null,null,null,null,null,null,null,null,null,null,null,null,null,null,null,null,null,null,null,null,"Promedio de Aprovechamiento de las Áreas de Desarrollo Personal y Social",null,null,null,null,null,"Prom. Final"]
["MODALIDAD","GRUPOS","Lengua Materna ",null,null,"Matemáticas",null,null,"Inglés",null,null,"Ciencias y tecnología (Biología)",null,null,"Historia",null,null,"Geografía",null,null,"Formación Cívica y Ética",null,null,"Tecnología I",null,null,"Educación Física",null,null,"Artes"]
[null,null,"CALIF",null,null,"CALIF",null,null,"CALIF",null,null,"CALIF",null,null,"CALIF",null,null,"CALIF",null,null,"CALIF",null,null,"CALIF",null,null,"CALIF",null,null,"CALIF",null,null,"CALIF"]
[{"$f":"IF(MATRICULA!B18=0,\"\",MATRICULA!B18)","v":"GENERALES PÚBLICAS"},185,8.4,null,null,8.3000000000000007,null,null,8.6,null,null,8.6,null,null,8.6,null,null,8.6,null,null,8.6,null,null,8.8000000000000007,null,null,9.3000000000000007,null,null,9,null,null,{"$f":"IFERROR(ROUND(AVERAGE(C16:AF16),1),\"\")","v":8.6999999999999993}]
[{"$f":"IF(MATRICULA!B19=0,\"\",MATRICULA!B19)","v":"GENERALES PARTICULARES"},102,8.4,null,null,8.4,null,null,8.8000000000000007,null,null,8.6,null,null,8.5,null,null,8.6999999999999993,null,null,8.8000000000000007,null,null,9,null,null,9.6,null,null,9.3000000000000007,null,null,8.8000000000000007]
[{"$f":"IF(MATRICULA!B20=0,\"\",MATRICULA!B20)","v":"SEC TÉCNICAS"},292,8.4,null,null,8.1999999999999993,null,null,8.4,null,null,8.5,null,null,8.4,null,null,8.6,null,null,8.4,null,null,8.6999999999999993,null,null,9.5,null,null,8.9,null,null,8.6]
[{"$f":"IF(MATRICULA!B21=0,\"\",MATRICULA!B21)","v":"TELESECUNDARIAS"},101,8.1999999999999993,null,null,8,null,null,8.1999999999999993,null,null,8.1999999999999993,null,null,8.1,null,null,8.1,null,null,8.5,null,null,9,null,null,9.1999999999999993,null,null,9.1,null,null,8.5]
[{"$f":"IF(MATRICULA!B22=0,\"\",MATRICULA!B22)","v":""},null,null,null,null,null,null,null,null,null,null,null,null,null,null,null,null,null,null,null,null,null,null,null,null,null,null,null,null,null,null,null,""]
["Gral.",{"$f":"IF(SUM(B16:B20)=0,\"\",SUM(B16:B20))","v":680},{"$f":"IFERROR(ROUND(AVERAGE(C16:E20),1),\"\")","v":8.4},null,null,{"$f":"IFERROR(ROUND(AVERAGE(F16:H20),1),\"\")","v":8.1999999999999993},null,null,{"$f":"IFERROR(ROUND(AVERAGE(I16:K20),1),\"\")","v":8.5},null,null,{"$f":"IFERROR(ROUND(AVERAGE(L16:N20),1),\"\")","v":8.5},null,null,{"$f":"IFERROR(ROUND(AVERAGE(O16:Q20),1),\"\")","v":8.4},null,null,{"$f":"IFERROR(ROUND(AVERAGE(R16:T20),1),\"\")","v":8.5},null,null,{"$f":"IFERROR(ROUND(AVERAGE(U16:W20),1),\"\")","v":8.6},null,null,{"$f":"IFERROR(ROUND(AVERAGE(X16:Z20),1),\"\")","v":8.9},null,null,{"$f":"IFERROR(ROUND(AVERAGE(AA16:AC20),1),\"\")","v":9.4},null,null,{"$f":"IFERROR(ROUND(AVERAGE(AD16:AF20),1),\"\")","v":9.1},null,null,8.6999999999999993]
[]
["Campos de Formación Académica en riesgo de no acreditar",null,null,null,null,null,null,null,null,null,null,null,null,null,null,null,null,null,null,null,null,null,null,null,null,null,"Áreas de Desarrollo Personal y Social en situación de riesgo de no acreditar",null,null,null,null,null,"Total"]
["MODALIDAD",null,"Lengua Materna",null,null,"Matemáticas",null,null,"Inglés",null,null,"Ciencias y tecnología (Biología)",null,null,"Historia",null,null,"Geografía",null,null,"Formación Cívica y Ética",null,null,"Tecnología I",null,null,"Educación Física",null,null,"Artes"]
[null,null,5,6,"T",5,6,"T",5,6,"T",5,6,"T",5,6,"T",5,6,"T",5,6,"T",5,6,"T",5,6,"T",5,6,"T",5,6]
[{"$f":"IF(MATRICULA!B18=0,\"\",MATRICULA!B18)","v":"GENERALES PÚBLICAS"},null,102,568,{"$f":"C26+D26","v":670},169,679,{"$f":"F26+G26","v":848},96,424,{"$f":"I26+J26","v":520},130,425,{"$f":"L26+M26","v":555},88,458,{"$f":"O26+P26","v":546},110,422,{"$f":"R26+S26","v":532},85,434,{"$f":"U26+V26","v":519},122,384,{"$f":"X26+Y26","v":506},37,87,{"$f":"AA26+AB26","v":124},43,279,{"$f":"AD26+AE26","v":322},{"$f":"C26+F26+I26+L26+O26+R26+U26+X26+AA26+AD26","v":982},{"$f":"D26+G26+J26+M26+P26+S26+V26+Y26+AB26+AE26","v":4160}]
[{"$f":"IF(MATRICULA!B19=0,\"\",MATRICULA!B19)","v":"GENERALES PARTICULARES"},null,12,53,{"$f":"C27+D27","v":65},22,125,{"$f":"F27+G27","v":147},6,84,{"$f":"I27+J27","v":90},15,83,{"$f":"L27+M27","v":98},9,97,{"$f":"O27+P27","v":106},2,75,{"$f":"R27+S27","v":77},8,83,{"$f":"U27+V27","v":91},4,50,{"$f":"X27+Y27","v":54},2,7,{"$f":"AA27+AB27","v":9},0,29,{"$f":"AD27+AE27","v":29},{"$f":"C27+F27+I27+L27+O27+R27+U27+X27+AA27+AD27","v":80},{"$f":"D27+G27+J27+M27+P27+S27+V27+Y27+AB27+AE27","v":686}]
[{"$f":"IF(MATRICULA!B20=0,\"\",MATRICULA!B20)","v":"SEC TÉCNICAS"},null,138,550,{"$f":"IF(SUM(C28,D28)=0,\"\",SUM(C28,D28))","v":688},113,663,{"$f":"IF(SUM(F28,G28)=0,\"\",SUM(F28,G28))","v":776},104,615,{"$f":"IF(SUM(I28,J28)=0,\"\",SUM(I28,J28))","v":719},117,536,{"$f":"IF(SUM(L28,M28)=0,\"\",SUM(L28,M28))","v":653},113,612,{"$f":"IF(SUM(O28,P28)=0,\"\",SUM(O28,P28))","v":725},99,457,{"$f":"IF(SUM(R28,S28)=0,\"\",SUM(R28,S28))","v":556},98,598,{"$f":"IF(SUM(U28,V28)=0,\"\",SUM(U28,V28))","v":696},84,421,{"$f":"IF(SUM(X28,Y28)=0,\"\",SUM(X28,Y28))","v":505},25,55,{"$f":"IF(SUM(AA28,AB28)=0,\"\",SUM(AA28,AB28))","v":80},49,296,{"$f":"IF(SUM(AD28,AE28)=0,\"\",SUM(AD28,AE28))","v":345},{"$f":"IF(SUM(C28,F28,I28,L28,O28,R28,U28,X28,AA28,AD28)=0,\"\",SUM(C28,F28,I28,L28,O28,R28,U28,X28,AA28,AD28))","v":940},4803]
[{"$f":"IF(MATRICULA!B21=0,\"\",MATRICULA!B21)","v":"TELESECUNDARIAS"},null,58,312,{"$f":"IF(SUM(C29,D29)=0,\"\",SUM(C29,D29))","v":370},57,397,{"$f":"IF(SUM(F29,G29)=0,\"\",SUM(F29,G29))","v":454},68,358,{"$f":"IF(SUM(I29,J29)=0,\"\",SUM(I29,J29))","v":426},59,303,{"$f":"IF(SUM(L29,M29)=0,\"\",SUM(L29,M29))","v":362},69,351,{"$f":"IF(SUM(O29,P29)=0,\"\",SUM(O29,P29))","v":420},69,309,{"$f":"IF(SUM(R29,S29)=0,\"\",SUM(R29,S29))","v":378},52,239,{"$f":"IF(SUM(U29,V29)=0,\"\",SUM(U29,V29))","v":291},51,122,{"$f":"IF(SUM(X29,Y29)=0,\"\",SUM(X29,Y29))","v":173},35,63,{"$f":"IF(SUM(AA29,AB29)=0,\"\",SUM(AA29,AB29))","v":98},44,129,{"$f":"IF(SUM(AD29,AE29)=0,\"\",SUM(AD29,AE29))","v":173},562,2583]
[{"$f":"IF(MATRICULA!B22=0,\"\",MATRICULA!B22)","v":""},null,null,null,{"$f":"IF(SUM(C30,D30)=0,\"\",SUM(C30,D30))","v":""},null,null,{"$f":"IF(SUM(F30,G30)=0,\"\",SUM(F30,G30))","v":""},null,null,{"$f":"IF(SUM(I30,J30)=0,\"\",SUM(I30,J30))","v":""},null,null,{"$f":"IF(SUM(L30,M30)=0,\"\",SUM(L30,M30))","v":""},null,null,{"$f":"IF(SUM(O30,P30)=0,\"\",SUM(O30,P30))","v":""},null,null,{"$f":"IF(SUM(R30,S30)=0,\"\",SUM(R30,S30))","v":""},null,null,{"$f":"IF(SUM(U30,V30)=0,\"\",SUM(U30,V30))","v":""},null,null,{"$f":"IF(SUM(X30,Y30)=0,\"\",SUM(X30,Y30))","v":""},null,null,{"$f":"IF(SUM(AA30,AB30)=0,\"\",SUM(AA30,AB30))","v":""},null,null,{"$f":"IF(SUM(AD30,AE30)=0,\"\",SUM(AD30,AE30))","v":""},"",""]
["Total",null,{"$f":"IF(SUM(C26:C30)=0,\"\",SUM(C26:C30))","v":310},1483,1793,361,1864,2225,274,1481,1755,321,1347,1668,279,1518,1797,280,1263,1543,243,1354,1597,261,977,1238,99,212,311,136,733,869,2564,12232]
[]
["Nota: Para las columnas \"Campos de Formación Académica y Áreas de Desarrollo Personal y Social en riesgo de no acreditar\" registre la cantidad de cincos o seis que existen en cada campo o área."]

{"sheet":"Gráfica APROV 1","index":2,"n_rows":18,"n_cols":14,"rows_kept":18,"cut":false,"hidden":false,"merged":[[8,7,8,20],[9,7,9,20],[9,0,9,6],[8,0,8,6],[33,0,47,32],[6,1,6,12],[5,13,5,25],[6,13,6,25],[0,0,0,32],[2,1,2,29],[3,1,3,29],[4,1,4,29],[5,1,5,12]]}
[]
[]
[null,"Secretaría de Educación Pública del Estado de Baja California Sur"]
[null,"Dirección de Educación Secundaria"]
[null,"PRIMER GRADO "]
[null,"PERIODO EVALUACIÓN:",null,null,null,null,null,null,null,null,null,null,null,{"$f":"MATRICULA!$O$7","v":"CONCENTRADO CIERRE CICLO ESCOLAR"}]
[null,"CICLO ESCOLAR :",null,null,null,null,null,null,null,null,null,null,null,{"$f":"MATRICULA!$O$8","v":"2022-2023"}]
[]
[null,null,null,null,null,null,null,{"$f":"MATRICULA!I11","v":"MTRA. OFELIA ELIZABETH OCHOA ROMERO"}]
[null,null,null,null,null,null,null,{"$f":"MATRICULA!I12","v":"DIRECCIÓN DE EDUCACIÓN SECUNDARIA"}]
[]
[]
[]
[]
[]
[]
[null,"Lengua Materna","Matemáticas","Inglés","Ciencias y tecnología (Biología)","Historia","Geografía","Formación Cívica y Ética","Tecnología I","Educación Física","Artes"]
[null,{"$f":"'APROV 1'!C21","v":8.4},{"$f":"'APROV 1'!F21","v":8.1999999999999993},{"$f":"'APROV 1'!I21","v":8.5},{"$f":"'APROV 1'!L21","v":8.5},{"$f":"'APROV 1'!O21","v":8.4},{"$f":"'APROV 1'!R21","v":8.5},{"$f":"'APROV 1'!U21","v":8.6},{"$f":"'APROV 1'!X21","v":8.9},{"$f":"'APROV 1'!AA21","v":9.4},{"$f":"'APROV 1'!AD21","v":9.1}]

{"sheet":"R1","index":3,"n_rows":22,"n_cols":8,"rows_kept":22,"cut":false,"hidden":false,"merged":[[14,0,14,7],[8,4,8,5],[9,4,9,5],[11,0,11,1],[11,2,11,7],[12,0,12,1],[12,2,12,7],[6,1,6,6],[0,0,0,7],[2,1,2,6],[3,1,3,6],[4,1,4,6],[5,1,5,6]]}
[]
[]
[null,"Secretaría de Educación Pública del Estado de Baja California Sur"]
[null,"Dirección de Educación Secundaria"]
[]
[null,"REGISTRO DE ALUMNOS CON CALIFICACIÓN \"5 Y 6\" EN UNA O MÁS ASIGNATURAS"]
[null,"PRIMER GRADO"]
[]
[null,null,"PERIODO DE EVALUACIÓN:",null,"CONCENTRADO CIERRE CICLO ESCOLAR"]
[null,null,"CICLO ESCOLAR:",null,{"$f":"[1]MATRICULA!O8","v":"2022-2023"}]
[]
[null,null,{"$f":"MATRICULA!I11","v":"MTRA. OFELIA ELIZABETH OCHOA ROMERO"}]
[null,null,{"$f":"MATRICULA!I12","v":"DIRECCIÓN DE EDUCACIÓN SECUNDARIA"}]
[]
["REGISTRAR LA CANTIDAD DE ALUMNOS CON CALIFICACIÓN \"5 Y 6\" EN UNA O MÁS ASIGNATURAS SEGÚN CORRESPONDA"]
["MODALIDAD","1 ASIGNATURA","2  ASIGNATURAS","3  ASIGNATURAS","4  ASIGNATURAS","5  ASIGNATURAS","6 O MÁS  ASIGNATURAS","TOTAL"]
[{"$f":"MATRICULA!B18","v":"GENERALES PÚBLICAS"},573,381,209,191,185,373,{"$f":"SUM(B17:G17)","v":1912}]
[{"$f":"MATRICULA!B19","v":"GENERALES PARTICULARES"},79,52,34,31,24,70,{"$f":"SUM(B18:G18)","v":290}]
[{"$f":"MATRICULA!B20","v":"SEC TÉCNICAS"},571,336,213,148,152,400,{"$f":"SUM(B19:G19)","v":1820}]
["TELESECUNDARIAS",100,59,47,38,42,136,{"$f":"SUM(B20:G20)","v":422}]
[]
["TOTAL",{"$f":"SUM(B17:B21)","v":1323},828,503,408,403,979,4444]

{"sheet":"Gráfica R1","index":4,"n_rows":18,"n_cols":14,"rows_kept":18,"cut":false,"hidden":false,"merged":[[10,26,10,30],[7,1,7,12],[7,13,7,25],[9,0,9,5],[9,9,9,22],[10,0,10,5],[10,9,10,22],[0,0,0,32],[2,1,2,31],[3,1,3,29],[4,1,4,29],[5,13,6,28],[6,1,6,12]]}
[]
[]
[null,"Secretaría de Educación Pública del Estado de Baja California Sur"]
[null,"Dirección de Educación Secundaria"]
[null,"PRIMER GRADO "]
[null,null,null,null,null,null,null,null,null,null,null,null,null,{"$f":"[1]MATRICULA!O7","v":"CIERRE DE CICLO ESCOLAR 2022-2023"}]
[null,"PERIODO EVALUACIÓN:"]
[null,"CICLO ESCOLAR :",null,null,null,null,null,null,null,null,null,null,null,{"$f":"[1]MATRICULA!O8","v":"2022-2023"}]
[]
[null,null,null,null,null,null,null,null,null,{"$f":"MATRICULA!I11","v":"MTRA. OFELIA ELIZABETH OCHOA ROMERO"}]
[null,null,null,null,null,null,null,null,null,{"$f":"MATRICULA!I12","v":"DIRECCIÓN DE EDUCACIÓN SECUNDARIA"}]
[]
[]
[]
[]
[]
[null,{"$f":"'R1'!B16","v":"1 ASIGNATURA"},{"$f":"'R1'!C16","v":"2  ASIGNATURAS"},{"$f":"'R1'!D16","v":"3  ASIGNATURAS"},{"$f":"'R1'!E16","v":"4  ASIGNATURAS"},{"$f":"'R1'!F16","v":"5  ASIGNATURAS"},{"$f":"'R1'!G16","v":"6 O MÁS  ASIGNATURAS"}]
[null,{"$f":"'R1'!B22","v":1323},{"$f":"'R1'!C22","v":828},{"$f":"'R1'!D22","v":503},{"$f":"'R1'!E22","v":408},{"$f":"'R1'!F22","v":403},{"$f":"'R1'!G22","v":979},null,{"$f":"'[2]APROV 1'!X38","v":""},{"$f":"'[2]APROV 1'!AA38","v":""},{"$f":"'[2]APROV 1'!AD38","v":""}]

{"sheet":"APROV 2","index":5,"n_rows":37,"n_cols":31,"rows_kept":37,"cut":false,"hidden":false,"merged":[[21,29,21,30],[13,0,13,7],[13,8,13,24],[22,2,22,4],[22,5,22,7],[22,8,22,10],[22,11,22,13],[22,14,22,16],[22,17,22,19],[22,20,22,22],[22,23,22,25],[16,23,16,28],[19,11,19,13],[19,14,19,16],[19,17,19,19],[19,20,19,22],[19,23,19,25],[19,26,19,28],[16,0,16,22],[17,1,18,1],[20,23,20,25],[16,29,16,30],[26,23,26,28],[26,29,26,30],[38,0,49,30],[18,8,18,10],[17,20,17,22],[18,14,18,16],[18,17,18,19],[18,20,18,22],[17,29,17,30],[17,0,18,0],[17,2,17,4],[17,5,17,7],[17,8,17,10],[17,26,17,28],[18,26,18,28],[19,2,19,4],[19,8,19,10],[19,29,19,30],[20,2,20,4],[20,5,20,7],[22,29,22,30],[17,14,17,16],[21,26,21,28],[23,26,23,28],[22,26,22,28],[34,0,34,1],[29,0,29,1],[27,0,28,1],[30,0,30,1],[31,0,31,1],[20,26,20,28],[14,5,14,11],[14,13,14,14],[23,23,23,25],[17,23,17,25],[18,23,18,25],[18,2,18,4],[18,29,18,30],[19,5,19,7],[21,5,21,7],[23,5,23,7],[23,11,23,13],[23,14,23,16],[20,8,20,10],[23,8,23,10],[20,29,20,30],[21,8,21,10],[21,11,21,13],[21,14,21,16],[21,17,21,19],[18,11,18,13],[21,2,21,4],[23,2,23,4],[23,17,23,19],[20,11,20,13],[23,29,23,30],[23,20,23,22],[27,26,27,28],[27,14,27,16],[24,20,24,22],[36,0,37,30],[24,14,24,16],[24,26,24,28],[24,17,24,19],[24,2,24,4],[27,29,27,30],[24,29,24,30],[24,5,24,7],[24,8,24,10],[27,2,27,4],[27,5,27,7],[27,8,27,10],[27,17,27,19],[27,23,27,25],[27,11,27,13],[32,0,32,1],[33,0,33,1],[27,20,27,22],[26,0,26,22],[24,23,24,25],[24,11,24,13],[20,14,20,16],[20,17,20,19],[20,20,20,22],[17,17,17,19],[21,20,21,22],[21,23,21,25],[3,2,3,27],[4,2,4,27],[5,2,5,27],[6,2,6,27],[7,14,7,24],[8,14,8,24],[7,2,7,13],[8,2,8,13],[12,0,12,7],[12,8,12,24],[17,11,17,13],[18,5,18,7]]}
[]
[]
[]
[null,null,"Secretaría de Educación Pública del Estado de Baja California Sur"]
[null,null,"Dirección de Educación Secundaria"]
[null,null,"APROVECHAMIENTO Y RIESGO DE NO ACREDITAR"]
[null,null,"SEGUNDO GRADO"]
[null,null,"PERIODO EVALUACIÓN:",null,null,null,null,null,null,null,null,null,null,null,{"$f":"IF('APROV 1'!O7:AA7<>0,'APROV 1'!O7:AA7, \"\")","v":"CONCENTRADO CIERRE CICLO ESCOLAR"}]
[null,null,"CICLO ESCOLAR :",null,null,null,null,null,null,null,null,null,null,null,{"$f":"IF('APROV 1'!O8:AA8<>0, 'APROV 1'!O8:AA8, \"\")","v":"2022-2023"}]
[]
[]
[]
[null,null,null,null,null,null,null,null,{"$f":"MATRICULA!I11","v":"MTRA. OFELIA ELIZABETH OCHOA ROMERO"}]
[null,null,null,null,null,null,null,null,{"$f":"MATRICULA!I12","v":"DIRECCIÓN DE EDUCACIÓN SECUNDARIA"}]
[]
[]
["Promedio de Aprovechamiento de los Campos de Formación Académica",null,null,null,null,null,null,null,null,null,null,null,null,null,null,null,null,null,null,null,null,null,null,"Promedio de Aprovechamiento de las Áreas de Desarrollo Personal y Social"]
["MODALIDAD","GRUPOS","Lengua Materna",null,null,"Matemáticas",null,null,"Inglés",null,null,"Ciencias y tecnología (Física)",null,null,"Historia ",null,null,"Formación Cívica y Ética",null,null,"Tecnología II",null,null,"Educación Física",null,null,"Artes",null,null,"Prom. Final"]
[null,null,"CALIF",null,null,"CALIF",null,null,"CALIF",null,null,"CALIF",null,null,"CALIF",null,null,"CALIF",null,null,"CALIF",null,null,"CALIF",null,null,"CALIF",null,null,"CALIF"]
[{"$f":"IF(MATRICULA!B18=0,\"\",MATRICULA!B18)","v":"GENERALES PÚBLICAS"},184,8.4,null,null,8.1999999999999993,null,null,8.6,null,null,8.4,null,null,8.6,null,null,8.6,null,null,8.8000000000000007,null,null,9.5,null,null,8.9,null,null,{"$f":"IFERROR(ROUND(AVERAGE(C20:AC20),1),\"\")","v":8.6999999999999993}]
[{"$f":"IF(MATRICULA!B19=0,\"\",MATRICULA!B19)","v":"GENERALES PARTICULARES"},94,8.6999999999999993,null,null,8.5,null,null,8.8000000000000007,null,null,8.6999999999999993,null,null,8.8000000000000007,null,null,8.8000000000000007,null,null,9.1,null,null,9.6999999999999993,null,null,9.4,null,null,8.9]
[{"$f":"IF(MATRICULA!B20=0,\"\",MATRICULA!B20)","v":"SEC TÉCNICAS"},179,8.4,null,null,8.1,null,null,8.4,null,null,8.4,null,null,8.4,null,null,8.5,null,null,8.6,null,null,9.4,null,null,8.9,null,null,8.6]
[{"$f":"IF(MATRICULA!B21=0,\"\",MATRICULA!B21)","v":"TELESECUNDARIAS"},104,8.3000000000000007,null,null,8.1,null,null,8.4,null,null,8.3000000000000007,null,null,8.3000000000000007,null,null,8.6,null,null,9.1,null,null,9.3000000000000007,null,null,9.1,null,null,8.6]
[{"$f":"IF(MATRICULA!B22=0,\"\",MATRICULA!B22)","v":""},null,null,null,null,null,null,null,null,null,null,null,null,null,null,null,null,null,null,null,null,null,null,null,null,null,null,null,null,""]
["Gral.",{"$f":"IF(SUM(B20:B24)=0,\"\",SUM(B20:B24))","v":561},{"$f":"IFERROR(ROUND(AVERAGE(C20:E24),1),\"\")","v":8.5},null,null,{"$f":"IFERROR(ROUND(AVERAGE(F20:H24),1),\"\")","v":8.1999999999999993},null,null,{"$f":"IFERROR(ROUND(AVERAGE(I20:K24),1),\"\")","v":8.6},null,null,{"$f":"IFERROR(ROUND(AVERAGE(L20:N24),1),\"\")","v":8.5},null,null,{"$f":"IFERROR(ROUND(AVERAGE(O20:Q24),1),\"\")","v":8.5},null,null,{"$f":"IFERROR(ROUND(AVERAGE(R20:T24),1),\"\")","v":8.6},null,null,{"$f":"IFERROR(ROUND(AVERAGE(U20:W24),1),\"\")","v":8.9},null,null,{"$f":"IFERROR(ROUND(AVERAGE(X20:Z24),1),\"\")","v":9.5},null,null,{"$f":"IFERROR(ROUND(AVERAGE(AA20:AC24),1),\"\")","v":9.1},null,null,8.6999999999999993]
[]
["Campos de Formación Académica en situacion de riesgo de no acreditar",null,null,null,null,null,null,null,null,null,null,null,null,null,null,null,null,null,null,null,null,null,null,"Áreas de Desarrollo Personal y Social en situación de riesgo de no acreditar"]
["MODALIDAD",null,"Lengua Materna",null,null,"Matemáticas",null,null,"Inglés",null,null,"Ciencias y tecnología (Física)",null,null,"Historia ",null,null,"Formación Cívica y Ética",null,null,"Tecnología II",null,null,"Educación Física",null,null,"Artes",null,null,"Total"]
[null,null,5,6,"T",5,6,"T",5,6,"T",5,6,"T",5,6,"T",5,6,"T",5,6,"T",5,6,"T",5,6,"T",5,6]
[{"$f":"IF(MATRICULA!B18=0,\"\",MATRICULA!B18)","v":"GENERALES PÚBLICAS"},null,87,570,{"$f":"C30+D30","v":657},137,695,{"$f":"F30+G30","v":832},84,457,{"$f":"I30+J30","v":541},112,688,{"$f":"L30+M30","v":800},86,566,{"$f":"O30+P30","v":652},77,373,{"$f":"R30+S30","v":450},87,334,{"$f":"U30+V30","v":421},18,74,{"$f":"X30+Y30","v":92},51,306,{"$f":"AA30+AB30","v":357},{"$f":"C30+F30+I30+L30+O30+R30+U30+X30+AA30","v":739},{"$f":"D30+G30+J30+M30+P30+S30+V30+Y30+AB30","v":4063}]
[{"$f":"IF(MATRICULA!B19=0,\"\",MATRICULA!B19)","v":"GENERALES PARTICULARES"},null,8,38,{"$f":"C31+D31","v":46},19,93,{"$f":"F31+G31","v":112},5,52,{"$f":"I31+J31","v":57},10,84,{"$f":"L31+M31","v":94},8,39,{"$f":"O31+P31","v":47},8,61,{"$f":"R31+S31","v":69},3,42,{"$f":"U31+V31","v":45},0,14,{"$f":"X31+Y31","v":14},1,28,{"$f":"AA31+AB31","v":29},{"$f":"C31+F31+I31+L31+O31+R31+U31+X31+AA31","v":62},{"$f":"D31+G31+J31+M31+P31+S31+V31+Y31+AB31","v":451}]
[{"$f":"IF(MATRICULA!B20=0,\"\",MATRICULA!B20)","v":"SEC TÉCNICAS"},null,188,533,{"$f":"IF(SUM(C32,D32)=0,\"\",SUM(C32,D32))","v":721},182,803,{"$f":"IF(SUM(F32,G32)=0,\"\",SUM(F32,G32))","v":985},107,606,{"$f":"IF(SUM(I32,J32)=0,\"\",SUM(I32,J32))","v":713},120,620,{"$f":"IF(SUM(L32,M32)=0,\"\",SUM(L32,M32))","v":740},155,575,{"$f":"IF(SUM(O32,P32)=0,\"\",SUM(O32,P32))","v":730},76,580,{"$f":"IF(SUM(R32,S32)=0,\"\",SUM(R32,S32))","v":656},78,417,{"$f":"IF(SUM(U32,V32)=0,\"\",SUM(U32,V32))","v":495},14,87,{"$f":"IF(SUM(X32,Y32)=0,\"\",SUM(X32,Y32))","v":101},52,250,{"$f":"IF(SUM(AA32,AB32)=0,\"\",SUM(AA32,AB32))","v":302},{"$f":"IF(SUM(C32,F32,I32,L32,O32,R32,U32,X32,AA32)=0,\"\",SUM(C32,F32,I32,L32,O32,R32,U32,X32,AA32))","v":972},4471]
[{"$f":"IF(MATRICULA!B21=0,\"\",MATRICULA!B21)","v":"TELESECUNDARIAS"},null,64,272,{"$f":"IF(SUM(C33,D33)=0,\"\",SUM(C33,D33))","v":336},80,323,{"$f":"IF(SUM(F33,G33)=0,\"\",SUM(F33,G33))","v":403},61,285,{"$f":"IF(SUM(I33,J33)=0,\"\",SUM(I33,J33))","v":346},69,327,{"$f":"IF(SUM(L33,M33)=0,\"\",SUM(L33,M33))","v":396},67,303,{"$f":"IF(SUM(O33,P33)=0,\"\",SUM(O33,P33))","v":370},63,200,{"$f":"IF(SUM(R33,S33)=0,\"\",SUM(R33,S33))","v":263},66,166,{"$f":"IF(SUM(U33,V33)=0,\"\",SUM(U33,V33))","v":232},38,54,{"$f":"IF(SUM(X33,Y33)=0,\"\",SUM(X33,Y33))","v":92},63,139,{"$f":"IF(SUM(AA33,AB33)=0,\"\",SUM(AA33,AB33))","v":202},571,2069]
[{"$f":"IF(MATRICULA!B22=0,\"\",MATRICULA!B22)","v":""},null,null,null,{"$f":"IF(SUM(C34,D34)=0,\"\",SUM(C34,D34))","v":""},null,null,{"$f":"IF(SUM(F34,G34)=0,\"\",SUM(F34,G34))","v":""},null,null,{"$f":"IF(SUM(I34,J34)=0,\"\",SUM(I34,J34))","v":""},null,null,{"$f":"IF(SUM(L34,M34)=0,\"\",SUM(L34,M34))","v":""},null,null,{"$f":"IF(SUM(O34,P34)=0,\"\",SUM(O34,P34))","v":""},null,null,{"$f":"IF(SUM(R34,S34)=0,\"\",SUM(R34,S34))","v":""},null,null,{"$f":"IF(SUM(U34,V34)=0,\"\",SUM(U34,V34))","v":""},null,null,{"$f":"IF(SUM(X34,Y34)=0,\"\",SUM(X34,Y34))","v":""},null,null,{"$f":"IF(SUM(AA34,AB34)=0,\"\",SUM(AA34,AB34))","v":""},"",""]
["Total",null,{"$f":"IF(SUM(C30:C34)=0,\"\",SUM(C30:C34))","v":347},1413,1760,418,1914,2332,257,1400,1657,311,1719,2030,316,1483,1799,224,1214,1438,234,959,1193,70,229,299,167,723,890,2344,11054]
[]
["Nota: Para las columnas \"Campos de Formación Académica y Áreas de Desarrollo Personal y Social en riesgo de no acreditar\" registre la cantidad de cincos o seis que existen en cada campo o área."]

{"sheet":"Gráfica APROV 2","index":6,"n_rows":13,"n_cols":14,"rows_kept":13,"cut":false,"hidden":false,"merged":[[8,0,8,7],[8,9,8,25],[9,26,9,30],[9,9,9,25],[9,0,9,7],[6,1,6,12],[6,13,6,25],[0,0,0,32],[2,1,2,29],[3,1,3,29],[4,1,4,29],[5,1,5,12],[5,13,5,25]]}
[]
[]
[null,"Secretaría de Educación Pública del Estado de Baja California Sur"]
[null,"Dirección de Educación Secundaria"]
[null,"SEGUNDO GRADO"]
[null,"PERIODO EVALUACIÓN:",null,null,null,null,null,null,null,null,null,null,null,{"$f":"MATRICULA!O7","v":"CONCENTRADO CIERRE CICLO ESCOLAR"}]
[null,"CICLO ESCOLAR :",null,null,null,null,null,null,null,null,null,null,null,{"$f":"MATRICULA!O8","v":"2022-2023"}]
[]
[null,null,null,null,null,null,null,null,null,{"$f":"MATRICULA!I11","v":"MTRA. OFELIA ELIZABETH OCHOA ROMERO"}]
[null,null,null,null,null,null,null,null,null,{"$f":"MATRICULA!I12","v":"DIRECCIÓN DE EDUCACIÓN SECUNDARIA"}]
[]
[null,"Lengua Materna","Matemáticas","Inglés","Ciencias y tecnología (Física)","Historia ","Formación Cívica y Ética ","Tecnología II","Educación Física","Artes"]
[null,{"$f":"'APROV 2'!C25","v":8.5},{"$f":"'APROV 2'!F25","v":8.1999999999999993},{"$f":"'APROV 2'!I25","v":8.6},{"$f":"'APROV 2'!L25","v":8.5},{"$f":"'APROV 2'!O25","v":8.5},{"$f":"'APROV 2'!R25","v":8.6},{"$f":"'APROV 2'!U25","v":8.9},{"$f":"'APROV 2'!X25","v":9.5},{"$f":"'APROV 2'!AA25","v":9.1}]

{"sheet":"R2","index":7,"n_rows":22,"n_cols":8,"rows_kept":22,"cut":false,"hidden":false,"merged":[[14,0,14,7],[8,4,8,5],[9,4,9,5],[11,0,11,1],[11,2,11,7],[12,0,12,1],[12,2,12,7],[6,1,6,6],[0,0,0,7],[2,1,2,6],[3,1,3,6],[4,1,4,6],[5,1,5,6]]}
[]
[]
[null,"Secretaría de Educación Pública del Estado de Baja California Sur"]
[null,"Dirección de Educación Secundaria"]
[]
[null,"REGISTRO DE ALUMNOS CON CALIFICACIÓN \"5 Y 6\" EN UNA O MÁS ASIGNATURAS"]
[null,"PRIMER GRADO"]
[]
[null,null,"PERIODO DE EVALUACIÓN:",null,"CONCENTRADO CIERRE CICLO ESCOLAR"]
[null,null,"CICLO ESCOLAR:",null,{"$f":"[1]MATRICULA!O8","v":"2022-2023"}]
[]
[null,null,{"$f":"MATRICULA!I11","v":"MTRA. OFELIA ELIZABETH OCHOA ROMERO"}]
[null,null,{"$f":"MATRICULA!I12","v":"DIRECCIÓN DE EDUCACIÓN SECUNDARIA"}]
[]
["REGISTRAR LA CANTIDAD DE ALUMNOS CON CALIFICACIÓN \"5 Y 6\" EN UNA O MÁS ASIGNATURAS SEGÚN CORRESPONDA"]
["MODALIDAD","1 ASIGNATURA","2  ASIGNATURAS","3  ASIGNATURAS","4  ASIGNATURAS","5  ASIGNATURAS","6 O MÁS  ASIGNATURAS","TOTAL"]
[{"$f":"MATRICULA!B18","v":"GENERALES PÚBLICAS"},622,372,268,264,188,255,{"$f":"SUM(B17:G17)","v":1969}]
[{"$f":"MATRICULA!B19","v":"GENERALES PARTICULARES"},76,59,29,18,5,17,{"$f":"SUM(B18:G18)","v":204}]
[{"$f":"MATRICULA!B20","v":"SEC TÉCNICAS"},557,351,220,184,127,336,{"$f":"SUM(B19:G19)","v":1775}]
["TELESECUNDARIAS",153,72,65,49,69,122,{"$f":"SUM(B20:G20)","v":530}]
[]
["TOTAL",{"$f":"IF(SUM(B17:B21)=0,\"\",SUM(B17:B21))","v":1408},854,582,515,389,730,4478]

{"sheet":"Gráfica R2","index":8,"n_rows":18,"n_cols":14,"rows_kept":18,"cut":false,"hidden":false,"merged":[[10,26,10,30],[7,1,7,12],[7,13,7,25],[9,0,9,5],[9,9,9,22],[10,0,10,5],[10,9,10,22],[0,0,0,32],[2,1,2,31],[3,1,3,29],[4,1,4,29],[5,13,6,28],[6,1,6,12]]}
[]
[]
[null,"Secretaría de Educación Pública del Estado de Baja California Sur"]
[null,"Dirección de Educación Secundaria"]
[null,"PRIMER GRADO "]
[null,null,null,null,null,null,null,null,null,null,null,null,null,{"$f":"[1]MATRICULA!O7","v":"CIERRE DE CICLO ESCOLAR 2022-2023"}]
[null,"PERIODO EVALUACIÓN:"]
[null,"CICLO ESCOLAR :",null,null,null,null,null,null,null,null,null,null,null,{"$f":"[1]MATRICULA!O8","v":"2022-2023"}]
[]
[null,null,null,null,null,null,null,null,null,{"$f":"MATRICULA!I11","v":"MTRA. OFELIA ELIZABETH OCHOA ROMERO"}]
[null,null,null,null,null,null,null,null,null,{"$f":"MATRICULA!I12","v":"DIRECCIÓN DE EDUCACIÓN SECUNDARIA"}]
[]
[]
[]
[]
[]
[null,{"$f":"[1]R1!B16","v":"1 ASIGNATURA"},{"$f":"'R2'!B16","v":"1 ASIGNATURA"},{"$f":"'R2'!C16","v":"2  ASIGNATURAS"},{"$f":"'R2'!D16","v":"3  ASIGNATURAS"},{"$f":"'R2'!E16","v":"4  ASIGNATURAS"},{"$f":"'R2'!F16","v":"5  ASIGNATURAS"},{"$f":"'R2'!G16","v":"6 O MÁS  ASIGNATURAS"}]
[null,{"$f":"[1]R1!B17","v":59},{"$f":"'R2'!B22","v":1408},{"$f":"'R2'!C22","v":854},{"$f":"'R2'!D22","v":582},{"$f":"'R2'!E22","v":515},{"$f":"'R2'!F22","v":389},{"$f":"'R2'!G22","v":730},{"$f":"'[2]APROV 1'!X38","v":""},{"$f":"'[2]APROV 1'!AA38","v":""},{"$f":"'[2]APROV 1'!AD38","v":""}]

{"sheet":"APROV 3","index":9,"n_rows":32,"n_cols":31,"rows_kept":32,"cut":false,"hidden":false,"merged":[[19,17,19,19],[19,20,19,22],[19,23,19,25],[19,26,19,28],[19,14,19,16],[15,26,15,28],[16,2,16,4],[16,5,16,7],[16,8,16,10],[16,11,16,13],[16,14,16,16],[16,17,16,19],[16,20,16,22],[16,26,16,28],[17,26,17,28],[18,2,18,4],[18,5,18,7],[18,8,18,10],[18,11,18,13],[18,14,18,16],[18,17,18,19],[18,20,18,22],[18,23,18,25],[18,26,18,28],[17,14,17,16],[17,17,17,19],[2,2,2,27],[3,2,3,27],[5,2,5,27],[6,2,6,13],[7,2,7,13],[6,14,6,24],[4,2,4,27],[9,0,9,7],[9,8,9,24],[7,14,7,24],[10,0,10,7],[10,8,10,24],[11,5,11,11],[11,13,11,14],[15,20,15,22],[15,23,15,25],[13,14,13,16],[13,17,13,19],[14,17,14,19],[17,20,17,22],[13,8,13,10],[23,17,23,19],[23,23,23,25],[13,23,13,25],[14,23,14,25],[12,0,12,22],[23,20,23,22],[22,0,22,22],[13,20,13,22],[14,20,14,22],[15,2,15,4],[19,8,19,10],[19,11,19,13],[20,17,20,19],[20,23,20,25],[20,11,20,13],[20,20,20,22],[13,0,14,0],[14,14,14,16],[13,1,14,1],[16,23,16,25],[15,8,15,10],[15,11,15,13],[15,14,15,16],[17,11,17,13],[31,0,32,30],[14,5,14,7],[14,11,14,13],[23,2,23,4],[23,5,23,7],[23,8,23,10],[23,11,23,13],[23,14,23,16],[22,23,22,28],[30,0,30,1],[17,23,17,25],[20,14,20,16],[20,5,20,7],[20,2,20,4],[20,8,20,10],[14,8,14,10],[15,5,15,7],[17,2,17,4],[17,5,17,7],[19,2,19,4],[19,5,19,7],[14,2,14,4],[15,17,15,19],[17,8,17,10],[12,29,13,30],[23,0,24,1],[25,0,25,1],[26,0,26,1],[27,0,27,1],[28,0,28,1],[29,0,29,1],[22,29,22,30],[23,26,23,28],[23,29,23,30],[20,29,20,30],[20,26,20,28],[13,26,13,28],[14,26,14,28],[12,23,12,28],[14,29,14,30],[15,29,15,30],[16,29,16,30],[17,29,17,30],[18,29,18,30],[19,29,19,30],[13,2,13,4],[13,5,13,7],[13,11,13,13]]}
[]
[]
[null,null,"Secretaría de Educación Pública del Estado de Baja California Sur"]
[null,null,"Dirección de Educación Secundaria"]
[null,null,"APROVECHAMIENTO Y RIESGO DE NO ACREDITAR"]
[null,null,"TERCER GRADO"]
[null,null,"PERIODO EVALUACIÓN:",null,null,null,null,null,null,null,null,null,null,null,{"$f":"IF('APROV 1'!O7:AA7<>0,'APROV 1'!O7:AA7, \"\")","v":"CONCENTRADO CIERRE CICLO ESCOLAR"}]
[null,null,"CICLO ESCOLAR :",null,null,null,null,null,null,null,null,null,null,null,{"$f":"IF('APROV 1'!O8:AA8<>0, 'APROV 1'!O8:AA8, \"\")","v":"2022-2023"}]
[]
[null,null,null,null,null,null,null,null,{"$f":"MATRICULA!I11","v":"MTRA. OFELIA ELIZABETH OCHOA ROMERO"}]
[null,null,null,null,null,null,null,null,{"$f":"MATRICULA!I12","v":"DIRECCIÓN DE EDUCACIÓN SECUNDARIA"}]
[]
["Promedio de Aprovechamiento de los Campos de Formación Académica",null,null,null,null,null,null,null,null,null,null,null,null,null,null,null,null,null,null,null,null,null,null,"Promedio de Aprovechamiento de las Áreas de Desarrollo Personal y Social",null,null,null,null,null,"Prom. Final"]
["MODALIDAD","GRUPOS","Español III",null,null,"Matemáticas III",null,null,"Segunda Lengua: Inglés III",null,null,"Ciencias III (Énfasis en Química)",null,null,"Historia II",null,null,"Formación Cívica y Ética II",null,null,"Tecnología III",null,null,"Educación Física III",null,null,"Artes III"]
[null,null,"CALIF",null,null,"CALIF",null,null,"CALIF",null,null,"CALIF",null,null,"CALIF",null,null,"CALIF",null,null,"CALIF",null,null,"CALIF",null,null,"CALIF",null,null,"CALIF"]
[{"$f":"IF(MATRICULA!B18=0,\"\",MATRICULA!B18)","v":"GENERALES PÚBLICAS"},185,8.6,null,null,8.3000000000000007,null,null,8.6999999999999993,null,null,8.6,null,null,8.6999999999999993,null,null,8.6999999999999993,null,null,8.9,null,null,9.5,null,null,9,null,null,{"$f":"IFERROR(ROUND(AVERAGE(C16:AC16),1),\"\")","v":8.8000000000000007}]
[{"$f":"IF(MATRICULA!B19=0,\"\",MATRICULA!B19)","v":"GENERALES PARTICULARES"},92,8.6999999999999993,null,null,8.6,null,null,8.9,null,null,8.6999999999999993,null,null,8.9,null,null,8.9,null,null,9.3000000000000007,null,null,9.6999999999999993,null,null,9.5,null,null,9]
[{"$f":"IF(MATRICULA!B20=0,\"\",MATRICULA!B20)","v":"SEC TÉCNICAS"},291,8.5,null,null,8.3000000000000007,null,null,8.5,null,null,8.5,null,null,8.5,null,null,8.6,null,null,8.8000000000000007,null,null,9.4,null,null,9,null,null,8.6999999999999993]
[{"$f":"IF(MATRICULA!B21=0,\"\",MATRICULA!B21)","v":"TELESECUNDARIAS"},103,8.5,null,null,8.3000000000000007,null,null,8.5,null,null,8.4,null,null,8.5,null,null,8.8000000000000007,null,null,9.1,null,null,9.3000000000000007,null,null,9.1999999999999993,null,null,8.6999999999999993]
[{"$f":"IF(MATRICULA!B22=0,\"\",MATRICULA!B22)","v":""},null,null,null,null,null,null,null,null,null,null,null,null,null,null,null,null,null,null,null,null,null,null,null,null,null,null,null,null,""]
["Gral.",{"$f":"IF(SUM(B16:B20)=0,\"\",SUM(B16:B20))","v":671},{"$f":"IFERROR(ROUND(AVERAGE(C16:E20),1),\"\")","v":8.6},null,null,{"$f":"IFERROR(ROUND(AVERAGE(F16:H20),1),\"\")","v":8.4},null,null,{"$f":"IFERROR(ROUND(AVERAGE(I16:K20),1),\"\")","v":8.6999999999999993},null,null,{"$f":"IFERROR(ROUND(AVERAGE(L16:N20),1),\"\")","v":8.6},null,null,{"$f":"IFERROR(ROUND(AVERAGE(O16:Q20),1),\"\")","v":8.6999999999999993},null,null,{"$f":"IFERROR(ROUND(AVERAGE(R16:T20),1),\"\")","v":8.8000000000000007},null,null,{"$f":"IFERROR(ROUND(AVERAGE(U16:W20),1),\"\")","v":9},null,null,{"$f":"IFERROR(ROUND(AVERAGE(X16:Z20),1),\"\")","v":9.5},null,null,{"$f":"IFERROR(ROUND(AVERAGE(AA16:AC20),1),\"\")","v":9.1999999999999993},null,null,8.8000000000000007]
[]
["Campos de Formación Académica en situacion de riesgo de no acreditar",null,null,null,null,null,null,null,null,null,null,null,null,null,null,null,null,null,null,null,null,null,null,"Áreas de Desarrollo Personal y Social en situación de riesgo de no acreditar"]
["MODALIDAD",null,"Español III",null,null,"Matemáticas III",null,null,"Segunda Lengua: Inglés III",null,null,"Ciencias III (Énfasis en Química)",null,null,"Historia II",null,null,"Formación Cívica y Ética II",null,null,"Tecnología III",null,null,"Educación Física III",null,null,"Artes III",null,null,"Total"]
[null,null,5,6,"T",5,6,"T",5,6,"T",5,6,"T",5,6,"T",5,6,"T",5,6,"T",5,6,"T",5,6,"T",5,6]
[{"$f":"IF(MATRICULA!B18=0,\"\",MATRICULA!B18)","v":"GENERALES PÚBLICAS"},null,121,590,{"$f":"C26+D26","v":711},111,848,{"$f":"F26+G26","v":959},91,434,{"$f":"I26+J26","v":525},103,561,{"$f":"L26+M26","v":664},93,419,{"$f":"O26+P26","v":512},66,406,{"$f":"R26+S26","v":472},72,326,{"$f":"U26+V26","v":398},29,105,{"$f":"X26+Y26","v":134},58,395,{"$f":"AA26+AB26","v":453},{"$f":"C26+F26+I26+L26+O26+R26+U26+X26+AA26","v":744},{"$f":"D26+G26+J26+M26+P26+S26+V26+Y26+AB26","v":4084}]
[{"$f":"IF(MATRICULA!B19=0,\"\",MATRICULA!B19)","v":"GENERALES PARTICULARES"},null,9,48,{"$f":"C27+D27","v":57},12,86,{"$f":"F27+G27","v":98},3,46,{"$f":"I27+J27","v":49},3,70,{"$f":"L27+M27","v":73},5,38,{"$f":"O27+P27","v":43},3,38,{"$f":"R27+S27","v":41},3,36,{"$f":"U27+V27","v":39},1,7,{"$f":"X27+Y27","v":8},6,20,{"$f":"AA27+AB27","v":26},{"$f":"C27+F27+I27+L27+O27+R27+U27+X27+AA27","v":45},{"$f":"D27+G27+J27+M27+P27+S27+V27+Y27+AB27","v":389}]
[{"$f":"IF(MATRICULA!B20=0,\"\",MATRICULA!B20)","v":"SEC TÉCNICAS"},null,106,398,{"$f":"IF(SUM(C28,D28)=0,\"\",SUM(C28,D28))","v":504},153,664,{"$f":"IF(SUM(F28,G28)=0,\"\",SUM(F28,G28))","v":817},76,523,{"$f":"IF(SUM(I28,J28)=0,\"\",SUM(I28,J28))","v":599},108,641,{"$f":"IF(SUM(L28,M28)=0,\"\",SUM(L28,M28))","v":749},152,484,{"$f":"IF(SUM(O28,P28)=0,\"\",SUM(O28,P28))","v":636},87,462,{"$f":"IF(SUM(R28,S28)=0,\"\",SUM(R28,S28))","v":549},107,334,{"$f":"IF(SUM(U28,V28)=0,\"\",SUM(U28,V28))","v":441},32,66,{"$f":"IF(SUM(X28,Y28)=0,\"\",SUM(X28,Y28))","v":98},62,212,{"$f":"IF(SUM(AA28,AB28)=0,\"\",SUM(AA28,AB28))","v":274},{"$f":"IF(SUM(C28,F28,I28,L28,O28,R28,U28,X28,AA28)=0,\"\",SUM(C28,F28,I28,L28,O28,R28,U28,X28,AA28))","v":883},3784]
[{"$f":"IF(MATRICULA!B21=0,\"\",MATRICULA!B21)","v":"TELESECUNDARIAS"},null,43,192,{"$f":"IF(SUM(C29,D29)=0,\"\",SUM(C29,D29))","v":235},47,239,{"$f":"IF(SUM(F29,G29)=0,\"\",SUM(F29,G29))","v":286},45,195,{"$f":"IF(SUM(I29,J29)=0,\"\",SUM(I29,J29))","v":240},54,216,{"$f":"IF(SUM(L29,M29)=0,\"\",SUM(L29,M29))","v":270},53,178,{"$f":"IF(SUM(O29,P29)=0,\"\",SUM(O29,P29))","v":231},47,160,{"$f":"IF(SUM(R29,S29)=0,\"\",SUM(R29,S29))","v":207},30,136,{"$f":"IF(SUM(U29,V29)=0,\"\",SUM(U29,V29))","v":166},17,39,{"$f":"IF(SUM(X29,Y29)=0,\"\",SUM(X29,Y29))","v":56},42,91,{"$f":"IF(SUM(AA29,AB29)=0,\"\",SUM(AA29,AB29))","v":133},378,1446]
[{"$f":"IF(MATRICULA!B22=0,\"\",MATRICULA!B22)","v":""},null,null,null,{"$f":"IF(SUM(C30,D30)=0,\"\",SUM(C30,D30))","v":""},null,null,{"$f":"IF(SUM(F30,G30)=0,\"\",SUM(F30,G30))","v":""},null,null,{"$f":"IF(SUM(I30,J30)=0,\"\",SUM(I30,J30))","v":""},null,null,{"$f":"IF(SUM(L30,M30)=0,\"\",SUM(L30,M30))","v":""},null,null,{"$f":"IF(SUM(O30,P30)=0,\"\",SUM(O30,P30))","v":""},null,null,{"$f":"IF(SUM(R30,S30)=0,\"\",SUM(R30,S30))","v":""},null,null,{"$f":"IF(SUM(U30,V30)=0,\"\",SUM(U30,V30))","v":""},null,null,{"$f":"IF(SUM(X30,Y30)=0,\"\",SUM(X30,Y30))","v":""},null,null,{"$f":"IF(SUM(AA30,AB30)=0,\"\",SUM(AA30,AB30))","v":""},"",""]
["Total",null,{"$f":"IF(SUM(C26:C30)=0,\"\",SUM(C26:C30))","v":279},1228,1507,323,1837,2160,215,1198,1413,268,1488,1756,303,1119,1422,203,1066,1269,212,832,1044,79,217,296,168,718,886,2050,9703]
["Nota: Para las columnas \"Campos de Formación Académica y Áreas de Desarrollo Personal y Social en riesgo de no acreditar\" registre la cantidad de cincos o seis que existen en cada campo o área."]

{"sheet":"Gráfica APROV 3","index":10,"n_rows":13,"n_cols":14,"rows_kept":13,"cut":false,"hidden":false,"merged":[[9,26,9,30],[8,0,8,7],[9,0,9,8],[9,9,9,24],[8,9,8,24],[6,13,6,23],[0,0,0,32],[2,1,2,29],[3,1,3,29],[4,1,4,29],[5,1,5,12],[6,1,6,12],[5,13,5,26]]}
[]
[]
[null,"Secretaría de Educación Pública del Estado de Baja California Sur"]
[null,"Dirección de Educación Secundaria"]
[null,"TERCER GRADO"]
[null,"PERIODO EVALUACIÓN:",null,null,null,null,null,null,null,null,null,null,null,{"$f":"MATRICULA!O7","v":"CONCENTRADO CIERRE CICLO ESCOLAR"}]
[null,"CICLO ESCOLAR :",null,null,null,null,null,null,null,null,null,null,null,{"$f":"MATRICULA!O8","v":"2022-2023"}]
[]
[null,null,null,null,null,null,null,null,null,{"$f":"MATRICULA!I11","v":"MTRA. OFELIA ELIZABETH OCHOA ROMERO"}]
[null,null,null,null,null,null,null,null,null,{"$f":"MATRICULA!I12","v":"DIRECCIÓN DE EDUCACIÓN SECUNDARIA"}]
[]
[null,"Español III","Matemáticas III","Segunda Lengua: Inglés III","Ciencias III (Énfasis en Química)","Historia II","Formación Cívica y Ética II","Tecnología III","Educación Física III","Artes III"]
[null,{"$f":"'APROV 3'!C21","v":8.6},{"$f":"'APROV 3'!F21","v":8.4},{"$f":"'APROV 3'!I21","v":8.6999999999999993},{"$f":"'APROV 3'!L21","v":8.6},{"$f":"'APROV 3'!O21","v":8.6999999999999993},{"$f":"'APROV 3'!R21","v":8.8000000000000007},{"$f":"'APROV 3'!U21","v":9},{"$f":"'APROV 3'!X21","v":9.5},{"$f":"'APROV 3'!AA21","v":9.1999999999999993}]

{"sheet":"R3","index":11,"n_rows":22,"n_cols":8,"rows_kept":22,"cut":false,"hidden":false,"merged":[[14,0,14,7],[8,4,8,5],[9,4,9,5],[11,0,11,1],[11,2,11,7],[12,0,12,1],[12,2,12,7],[6,1,6,6],[0,0,0,7],[2,1,2,6],[3,1,3,6],[4,1,4,6],[5,1,5,6]]}
[]
[]
[null,"Secretaría de Educación Pública del Estado de Baja California Sur"]
[null,"Dirección de Educación Secundaria"]
[]
[null,"REGISTRO DE ALUMNOS CON CALIFICACIÓN \"5 Y 6\" EN UNA O MÁS ASIGNATURAS"]
[null,"PRIMER GRADO"]
[]
[null,null,"PERIODO DE EVALUACIÓN:",null,"CONCENTRADO CIERRE CICLO ESCOLAR"]
[null,null,"CICLO ESCOLAR:",null,{"$f":"[1]MATRICULA!O8","v":"2022-2023"}]
[]
[null,null,{"$f":"MATRICULA!I11","v":"MTRA. OFELIA ELIZABETH OCHOA ROMERO"}]
[null,null,{"$f":"MATRICULA!I12","v":"DIRECCIÓN DE EDUCACIÓN SECUNDARIA"}]
[]
["REGISTRAR LA CANTIDAD DE ALUMNOS CON CALIFICACIÓN \"5 Y 6\" EN UNA O MÁS ASIGNATURAS SEGÚN CORRESPONDA"]
["MODALIDAD","1 ASIGNATURA","2  ASIGNATURAS","3  ASIGNATURAS","4  ASIGNATURAS","5  ASIGNATURAS","6 O MÁS  ASIGNATURAS","TOTAL"]
[{"$f":"MATRICULA!B18","v":"GENERALES PÚBLICAS"},544,324,228,203,134,227,{"$f":"SUM(B17:G17)","v":1660}]
[{"$f":"MATRICULA!B19","v":"GENERALES PARTICULARES"},144,60,43,29,17,19,{"$f":"SUM(B18:G18)","v":312}]
[{"$f":"MATRICULA!B20","v":"SEC TÉCNICAS"},510,242,181,198,97,337,{"$f":"SUM(B19:G19)","v":1565}]
["TELESECUNDARIAS",81,66,20,28,26,74,{"$f":"SUM(B20:G20)","v":295}]
[null,null,null,null,null,null,null,{"$f":"SUM(B21:G21)","v":0}]
["TOTAL",{"$f":"IF(SUM(B17:B21)=0,\"\",SUM(B17:B21))","v":1279},692,472,458,274,657,3832]

{"sheet":"Gráfica R3","index":12,"n_rows":18,"n_cols":14,"rows_kept":18,"cut":false,"hidden":false,"merged":[[10,26,10,30],[14,3,14,16],[7,1,7,12],[7,13,7,25],[9,0,9,5],[9,9,9,22],[10,0,10,5],[10,9,10,22],[0,0,0,32],[2,1,2,31],[3,1,3,29],[4,1,4,29],[5,13,6,28],[6,1,6,12]]}
[]
[]
[null,"Secretaría de Educación Pública del Estado de Baja California Sur"]
[null,"Dirección de Educación Secundaria"]
[null,"PRIMER GRADO "]
[null,null,null,null,null,null,null,null,null,null,null,null,null,{"$f":"[1]MATRICULA!O7","v":"CIERRE DE CICLO ESCOLAR 2022-2023"}]
[null,"PERIODO EVALUACIÓN:"]
[null,"CICLO ESCOLAR :",null,null,null,null,null,null,null,null,null,null,null,{"$f":"[1]MATRICULA!O8","v":"2022-2023"}]
[]
[null,null,null,null,null,null,null,null,null,{"$f":"MATRICULA!I11","v":"MTRA. OFELIA ELIZABETH OCHOA ROMERO"}]
[null,null,null,null,null,null,null,null,null,{"$f":"MATRICULA!I12","v":"DIRECCIÓN DE EDUCACIÓN SECUNDARIA"}]
[]
[]
[]
[]
[]
[null,{"$f":"[1]R1!B16","v":"1 ASIGNATURA"},{"$f":"'R3'!B16","v":"1 ASIGNATURA"},{"$f":"'R3'!C16","v":"2  ASIGNATURAS"},{"$f":"'R3'!D16","v":"3  ASIGNATURAS"},{"$f":"'R3'!E16","v":"4  ASIGNATURAS"},{"$f":"'R3'!F16","v":"5  ASIGNATURAS"},{"$f":"'R3'!G16","v":"6 O MÁS  ASIGNATURAS"}]
[null,{"$f":"[1]R1!B17","v":59},{"$f":"'R3'!B22","v":1279},{"$f":"'R3'!C22","v":692},{"$f":"'R3'!D22","v":472},{"$f":"'R3'!E22","v":458},{"$f":"'R3'!F22","v":274},{"$f":"'R3'!G22","v":657}]

{"sheet":"Gráfica Promedios Finales","index":13,"n_rows":15,"n_cols":14,"rows_kept":15,"cut":false,"hidden":false,"merged":[[25,0,105,31],[8,0,8,6],[8,8,8,25],[7,0,7,7],[7,8,7,25],[0,0,0,31],[2,1,2,29],[3,1,3,29],[4,1,4,12],[5,1,5,12],[5,13,5,25]]}
[]
[]
[null,"Secretaría de Educación Pública del Estado de Baja California Sur"]
[null,"Dirección de Educación Secundaria"]
[null,"PERIODO DE EVALUACIÓN:",null,null,null,null,null,null,null,null,null,null,null,{"$f":"MATRICULA!O7","v":"CONCENTRADO CIERRE CICLO ESCOLAR"}]
[null,"CICLO ESCOLAR :",null,null,null,null,null,null,null,null,null,null,null,{"$f":"MATRICULA!O8","v":"2022-2023"}]
[]
[null,null,null,null,null,null,null,null,{"$f":"MATRICULA!I11","v":"MTRA. OFELIA ELIZABETH OCHOA ROMERO"}]
[null,null,null,null,null,null,null,null,{"$f":"MATRICULA!I12","v":"DIRECCIÓN DE EDUCACIÓN SECUNDARIA"}]
[]
[]
[]
[]
[null,"PROMEDIO 1RO","PROMEDIO 2DO","PROMEDIO 3ERO"]
[null,{"$f":"+'APROV 1'!AG21","v":8.6999999999999993},{"$f":"+'APROV 2'!AD25","v":8.6999999999999993},{"$f":"'APROV 3'!AD21","v":8.8000000000000007}]

{"sheet":"NORMALIDAD MÍNIMA","index":14,"n_rows":45,"n_cols":18,"rows_kept":45,"cut":false,"hidden":false,"merged":[[36,1,36,2],[30,3,30,4],[31,3,31,4],[32,3,32,4],[33,3,33,4],[34,3,34,4],[35,3,35,4],[36,3,36,4],[31,1,31,2],[32,1,32,2],[33,1,33,2],[34,1,34,2],[35,1,35,2],[29,13,29,14],[29,15,29,16],[38,11,38,16],[9,0,9,5],[8,6,8,14],[28,0,28,17],[11,15,11,16],[19,0,19,17],[11,10,11,12],[11,13,11,14],[11,0,12,0],[11,6,11,8],[20,13,20,14],[20,15,20,16],[20,0,21,0],[29,0,30,0],[29,1,29,5],[29,6,29,8],[29,9,30,9],[11,9,12,9],[20,10,20,12],[29,10,29,12],[20,1,27,5],[20,6,20,8],[20,9,21,9],[11,1,11,2],[11,3,11,4],[30,1,30,2],[9,6,9,14],[2,1,2,16],[3,1,3,16],[4,1,4,16],[5,1,5,9],[6,1,6,8],[5,10,5,14],[6,10,6,14],[46,0,62,17],[37,0,37,17],[45,0,45,17],[38,0,38,10],[42,0,42,10],[42,11,42,16],[40,11,40,16],[44,0,44,10],[41,0,41,10],[43,0,43,10],[43,11,43,16],[41,11,41,16],[39,0,39,10],[39,11,39,16],[40,0,40,10]]}
[]
[]
[null,"Secretaría de Educación Pública del Estado de Baja California Sur"]
[null,"Dirección de Educación Secundaria"]
[null,"NORMALIDAD MÍNIMA"]
[null,"PERIODO DE EVALUACIÓN:",null,null,null,null,null,null,null,null,{"$f":"IF('APROV 1'!O7<>0,'APROV 1'!O7, \"\")","v":"CONCENTRADO CIERRE CICLO ESCOLAR"}]
[null,"CICLO ESCOLAR :",null,null,null,null,null,null,null,null,{"$f":"IF('APROV 1'!O8<>0, 'APROV 1'!O8, \"\")","v":"2022-2023"}]
[]
[null,null,null,null,null,null,{"$f":"MATRICULA!I11","v":"MTRA. OFELIA ELIZABETH OCHOA ROMERO"}]
[null,null,null,null,null,null,{"$f":"MATRICULA!I12","v":"DIRECCIÓN DE EDUCACIÓN SECUNDARIA"}]
[]
["MODALIDAD","DIRECTIVOS\nDirectores",null,"DIRECTIVOS\nSubdirectores",null,null,"COORDINADORES",null,null,"R","INASISTENCIAS",null,null,"LICENCIAS ECONÓMICAS",null,"LICENCIAS MÉDICAS",null,"TOTAL DE DÍAS NO LABORADOS"]
[null,"H","M","H","M","T","H","M","T",null,"I ","P.D.","D.N.L.I y P.D.","L.E."," D.N.L.E.","L.M.","D.N.L.M.","DNLI y PD, DNLE, DNLM"]
[{"$f":"IF(MATRICULA!B18=0,\"\",MATRICULA!B18)","v":"GENERALES PÚBLICAS"},33,10,18,19,{"$f":"IF(SUM(B14:E14)=0,\"\",SUM(B14:E14))","v":80},18,15,{"$f":"IF(SUM(G14,H14)=0,\"\",SUM(G14,H14))","v":33},14,3,66,{"$f":"K14+L14","v":69},114,246,95,564,{"$f":"IF(SUM(M14,O14,Q14)=0,\"\",SUM(M14,O14,Q14))","v":879}]
[{"$f":"IF(MATRICULA!B19=0,\"\",MATRICULA!B19)","v":"GENERALES PARTICULARES"},null,null,null,null,{"$f":"IF(SUM(B15:E15)=0,\"\",SUM(B15:E15))","v":""},null,null,{"$f":"IF(SUM(G15,H15)=0,\"\",SUM(G15,H15))","v":""},null,null,null,null,null,null,null,null,{"$f":"IF(SUM(M15,O15,Q15)=0,\"\",SUM(M15,O15,Q15))","v":""}]
[{"$f":"IF(MATRICULA!B20=0,\"\",MATRICULA!B20)","v":"SEC TÉCNICAS"},18,13,20,10,{"$f":"IF(SUM(B16:E16)=0,\"\",SUM(B16:E16))","v":61},29,20,{"$f":"IF(SUM(G16,H16)=0,\"\",SUM(G16,H16))","v":49},null,7,26,{"$f":"K16+L16","v":33},75,202,38,238,{"$f":"IF(SUM(M16,O16,Q16)=0,\"\",SUM(M16,O16,Q16))","v":473}]
[{"$f":"IF(MATRICULA!B21=0,\"\",MATRICULA!B21)","v":"TELESECUNDARIAS"},17,6,10,3,{"$f":"IF(SUM(B17:E17)=0,\"\",SUM(B17:E17))","v":36},null,null,{"$f":"IF(SUM(G17,H17)=0,\"\",SUM(G17,H17))","v":""},null,null,125,{"$f":"K17+L17","v":125},43,113,8,35,{"$f":"IF(SUM(M17,O17,Q17)=0,\"\",SUM(M17,O17,Q17))","v":273}]
[{"$f":"IF(MATRICULA!B22=0,\"\",MATRICULA!B22)","v":""},null,null,null,null,{"$f":"IF(SUM(B18:E18)=0,\"\",SUM(B18:E18))","v":""},null,null,{"$f":"IF(SUM(G18,H18)=0,\"\",SUM(G18,H18))","v":""},null,null,null,{"$f":"IF(SUM(K18,L18)=0,\"\",SUM(K18,L18))","v":""},null,null,null,null,{"$f":"IF(SUM(M18,O18,Q18)=0,\"\",SUM(M18,O18,Q18))","v":""}]
["Total",{"$f":"IF(SUM(B14:B18)=0,\"\",SUM(B14:B18))","v":68},29,48,32,177,47,35,82,14,10,217,227,232,561,141,837,1625]
[]
["MODALIDAD","PERSONAL  POR HORAS ",null,null,null,null,"DOCENTES",null,null,"R","INASISTENCIAS (Horas)",null,null,"LICENCIAS ECONÓMICAS",null,"LICENCIAS MÉDICAS",null,"TOTAL DE HORAS NO LABORADOS"]
[null,null,null,null,null,null,"F","E","T",null,"I ","P.D.","H.N.L.I y P.D.","L.E."," H.N.L.E.","L.M.","H.N.L.M.","HNLI y PD, HNLE, HNLM"]
[{"$f":"IF(MATRICULA!B18=0,\"\",MATRICULA!B18)","v":"GENERALES PÚBLICAS"},null,null,null,null,null,1072,114,{"$f":"IF(SUM(G23,H23)=0,\"\",SUM(G23,H23))","v":1186},1865,6051,1661,{"$f":"IF(SUM(K23,L23)=0,\"\",SUM(K23,L23))","v":7712},1814,15326,1074,12364,{"$f":"IF(SUM(M23,O23,Q23)=0,\"\",SUM(M23,O23,Q23))","v":35402}]
[{"$f":"IF(MATRICULA!B19=0,\"\",MATRICULA!B19)","v":"GENERALES PARTICULARES"},null,null,null,null,null,null,null,{"$f":"IF(SUM(G24,H24)=0,\"\",SUM(G24,H24))","v":""},null,null,null,{"$f":"IF(SUM(K24,L24)=0,\"\",SUM(K24,L24))","v":""},null,null,null,null,{"$f":"IF(SUM(M24,O24,Q24)=0,\"\",SUM(M24,O24,Q24))","v":""}]
[{"$f":"IF(MATRICULA!B20=0,\"\",MATRICULA!B20)","v":"SEC TÉCNICAS"},null,null,null,null,null,739,146,{"$f":"IF(SUM(G25,H25)=0,\"\",SUM(G25,H25))","v":885},740,3769,1591,{"$f":"IF(SUM(K25,L25)=0,\"\",SUM(K25,L25))","v":5360},1162,11129,596,9809,{"$f":"IF(SUM(M25,O25,Q25)=0,\"\",SUM(M25,O25,Q25))","v":26298}]
[{"$f":"IF(MATRICULA!B21=0,\"\",MATRICULA!B21)","v":"TELESECUNDARIAS"},null,null,null,null,null,238,41,{"$f":"IF(SUM(G26,H26)=0,\"\",SUM(G26,H26))","v":279},null,12,null,{"$f":"IF(SUM(K26,L26)=0,\"\",SUM(K26,L26))","v":12},395,2681,166,1132,{"$f":"IF(SUM(M26,O26,Q26)=0,\"\",SUM(M26,O26,Q26))","v":3825}]
[{"$f":"IF(MATRICULA!B22=0,\"\",MATRICULA!B22)","v":""},null,null,null,null,null,null,null,{"$f":"IF(SUM(G27,H27)=0,\"\",SUM(G27,H27))","v":""},null,null,null,{"$f":"IF(SUM(K27,L27)=0,\"\",SUM(K27,L27))","v":""},null,null,null,null,{"$f":"IF(SUM(M27,O27,Q27)=0,\"\",SUM(M27,O27,Q27))","v":""}]
["Total",null,null,null,null,null,{"$f":"IF(SUM(G23:G27)=0,\"\",SUM(G23:G27))","v":2049},301,2350,2605,9832,3252,13084,3371,29136,1836,23305,65525]
[]
["MODALIDAD","ASISTENCIA EDUCATIVA\n(Psicólogos, trabajo social, médicos, prefectos)",null,null,null,null,"ADMINISTRATIVO Y DE APOYO",null,null,"R","INASISTENCIAS",null,null,"LICENCIAS ECONÓMICAS",null,"LICENCIAS MÉDICAS",null,"TOTAL DE DÍAS NO LABORADOS"]
[null,"F",null,"E",null,"T","F","E","T",null,"I ","P.D.","D.N.L.I y P.D.","L.E."," D.N.L.E.","L.M.","D.N.L.M.","DNLI y PD, DNLE, DNLM"]
[{"$f":"IF(MATRICULA!B18=0,\"\",MATRICULA!B18)","v":"GENERALES PÚBLICAS"},170,null,47,null,{"$f":"IF(SUM(B32:E32)=0,\"\",SUM(B32:E32))","v":217},325,179,{"$f":"IF(SUM(G32,H32)=0,\"\",SUM(G32,H32))","v":504},675,658,157,{"$f":"IF(SUM(K32,L32)=0,\"\",SUM(K32,L32))","v":815},999,2777,382,2334,{"$f":"IF(SUM(M32,O32,Q32)=0,\"\",SUM(M32,O32,Q32))","v":5926}]
[{"$f":"IF(MATRICULA!B19=0,\"\",MATRICULA!B19)","v":"GENERALES PARTICULARES"},null,null,null,null,{"$f":"IF(SUM(B33:E33)=0,\"\",SUM(B33:E33))","v":""},null,null,{"$f":"IF(SUM(G33,H33)=0,\"\",SUM(G33,H33))","v":""},null,null,null,{"$f":"IF(SUM(K33,L33)=0,\"\",SUM(K33,L33))","v":""},null,null,null,null,{"$f":"IF(SUM(M33,O33,Q33)=0,\"\",SUM(M33,O33,Q33))","v":""}]
[{"$f":"IF(MATRICULA!B20=0,\"\",MATRICULA!B20)","v":"SEC TÉCNICAS"},132,null,44,null,{"$f":"IF(SUM(B34:E34)=0,\"\",SUM(B34:E34))","v":176},207,117,{"$f":"IF(SUM(G34,H34)=0,\"\",SUM(G34,H34))","v":324},60,517,206,{"$f":"IF(SUM(K34,L34)=0,\"\",SUM(K34,L34))","v":723},650,1648,281,1686,{"$f":"IF(SUM(M34,O34,Q34)=0,\"\",SUM(M34,O34,Q34))","v":4057}]
[{"$f":"IF(MATRICULA!B21=0,\"\",MATRICULA!B21)","v":"TELESECUNDARIAS"},14,null,14,null,{"$f":"IF(SUM(B35:E35)=0,\"\",SUM(B35:E35))","v":28},35,66,{"$f":"IF(SUM(G35,H35)=0,\"\",SUM(G35,H35))","v":101},2,5,41,{"$f":"IF(SUM(K35,L35)=0,\"\",SUM(K35,L35))","v":46},188,596,100,939,{"$f":"IF(SUM(M35,O35,Q35)=0,\"\",SUM(M35,O35,Q35))","v":1581}]
[{"$f":"IF(MATRICULA!B22=0,\"\",MATRICULA!B22)","v":""},null,null,null,null,{"$f":"IF(SUM(B36:E36)=0,\"\",SUM(B36:E36))","v":""},null,null,{"$f":"IF(SUM(G36,H36)=0,\"\",SUM(G36,H36))","v":""},null,null,null,{"$f":"IF(SUM(K36,L36)=0,\"\",SUM(K36,L36))","v":""},null,null,null,null,{"$f":"IF(SUM(M36,O36,Q36)=0,\"\",SUM(M36,O36,Q36))","v":""}]
["Total",{"$f":"IF(SUM(B32:B36)=0,\"\",SUM(B32:B36))","v":316},null,{"$f":"IF(SUM(D32:D36)=0,\"\",SUM(D32:D36))","v":105},null,{"$f":"IF(SUM(F32:F36)=0,\"\",SUM(F32:F36))","v":421},567,362,929,737,1180,404,1584,1837,5021,763,4959,11564]
[]
["NOTA:",null,null,null,null,null,null,null,null,null,null,"NOTA:"]
["I.: INASISTENCIAS",null,null,null,null,null,null,null,null,null,null,"H.N.L.E.: HORAS NO LABORADOS POR LICENCIAS ECONÓMICAS"]
["H.N.L.I.: HORAS NO LABORADAS POR INASISTENCIAS",null,null,null,null,null,null,null,null,null,null,"D.N.L.E.:  DÍAS NO LABORADOS POR LICENCIAS ECONÓMICAS"]
["D.N.L.I.: DÍAS NO LABORADOS POR INASISTENCIAS",null,null,null,null,null,null,null,null,null,null,"L.M.: PERSONAS QUE PRESENTARON LICENCIAS MÉDICAS"]
["R. :  CANTIDAD DE RETARDOS",null,null,null,null,null,null,null,null,null,null,"H.N.L.M.: HORAS NO LABORADAS POR LICENCIAS MÉDICAS"]
["L.E.:   PERSONAL QUE SOLICITÓ LICENCIAS ECONÓMICAS",null,null,null,null,null,null,null,null,null,null,"D.N.L.M.: DÍAS NO LABORADOS POR LICENCIAS MÉDICAS"]
["P.D.: PERMISOS DIRECCIÓN",null,null,null,null,null,null,null,null,null,null,"F: FONE     E: EVENTUALES"]