{"text_format":"1","workbook":"xlsx","n_sheets":9,"sheets":["MATRICULA","APROV 1","Gráfica APROV 1","APROV 2","Gráfica APROV 2","APROV 3","Gráfica APROV 3","Gráfica Promedios Finales","NORMALIDAD MÍNIMA"],"not_rendered":{"charts":4,"images":1,"macros":1,"external_links":0,"defined_names":7,"comments":0,"pivot_tables":0},"unopened":[],"bounds":{"document_bytes":16777216,"sheet_cells":100000,"rows_first":2000,"rows_last":500,"rows_between":2000,"halvings":0,"cell_chars":16384,"cell_head_chars":4096},"cells_cut":0,"cells_raw":0,"read":"whole","date_system":"1900"}

{"sheet":"MATRICULA","index":0,"n_rows":34,"n_cols":38,"rows_kept":34,"cut":false,"hidden":false,"merged":[[10,8,10,26],[10,1,10,7],[15,14,15,16],[11,8,11,26],[11,27,11,31],[1,2,1,30],[2,2,2,30],[4,2,4,30],[7,2,7,13],[7,14,7,26],[6,2,6,13],[6,14,6,26],[25,14,25,25],[15,17,15,19],[15,20,15,22],[26,35,26,37],[26,8,26,10],[26,11,26,13],[26,14,26,16],[26,17,26,19],[26,20,26,22],[26,23,26,25],[26,26,26,28],[26,29,26,31],[26,32,26,34],[15,23,15,25],[11,32,11,33],[11,1,12,7],[24,1,27,1],[24,2,24,25],[13,1,16,1],[13,2,13,25],[26,2,26,4],[26,5,26,7],[14,2,14,13],[14,14,14,25],[15,2,15,4],[15,5,15,7],[15,8,15,10],[15,11,15,13],[24,26,25,37],[25,2,25,13]]}
[]
[null,null,"Secretaría de Educación Pública del Estado de Baja California Sur"]
[null,null,"Dirección de Educación Secundaria"]
[]
[null,null,"MATRÍCULA"]
[]
[null,null,"PERIODO DE EVALUACIÓN:",null,null,null,null,null,null,null,null,null,null,null,"CONCENTRADO TERCER PERIODO DE EVALUACIÓN"]
[null,null,"CICLO ESCOLAR :",null,null,null,null,null,null,null,null,null,null,null,"2022-2023"]
[]
[]
[null,null,null,null,null,null,null,null,"MTRA. OFELIA ELIZABETH OCHOA ROMERO"]
[null,null,null,null,null,null,null,null,"DIRECCIÓN DE EDUCACIÓN SECUNDARIA"]
[]
[null,"MODALIDAD","MATRÍCULA"]
[null,null,"INSCRIPCIÓN INICIAL ",null,null,null,null,null,null,null,null,null,null,null,"CAMBIOS DESDE OTRAS ESCUELAS (ALTAS)"]
[null,null,"PRIMERO",null,null,"SEGUNDO",null,null,"TERCERO",null,null,"TOTAL",null,null,"PRIMERO",null,null,"SEGUNDO",null,null,"TERCERO",null,null,"TOTAL"]
[null,null,"H","M","T","H","M","T","H","M","T","H","M","T","H","M","T","H","M","T","H","M","T","H","M","T"]
[null,"GENERALES PÚBLICAS",2862,2805,{"$f":"C18+D18","v":5667},2805,2701,{"$f":"F18+G18","v":5506},2785,2883,{"$f":"I18+J18","v":5668},{"$f":"C18+F18+I18","v":8452},{"$f":"D18+G18+J18","v":8389},{"$f":"L18+M18","v":16841},54,44,{"$f":"O18+P18","v":98},35,53,{"$f":"R18+S18","v":88},20,19,{"$f":"U18+V18","v":39},{"$f":"O18+R18+U18","v":109},{"$f":"P18+S18+V18","v":116},{"$f":"X18+Y18","v":225}]
[null,"GENERALES PARTICULARES",800,763,{"$f":"C19+D19","v":1563},641,650,{"$f":"F19+G19","v":1291},596,628,{"$f":"I19+J19","v":1224},{"$f":"C19+F19+I19","v":2037},{"$f":"D19+G19+J19","v":2041},{"$f":"L19+M19","v":4078},21,16,{"$f":"O19+P19","v":37},19,33,{"$f":"R19+S19","v":52},10,11,{"$f":"U19+V19","v":21},{"$f":"O19+R19+U19","v":50},{"$f":"P19+S19+V19","v":60},{"$f":"X19+Y19","v":110}]
[null,"SEC TÉCNICAS",2567,2530,{"$f":"IF(SUM(C20,D20)=0,\"\",SUM(C20,D20))","v":5097},2579,2528,{"$f":"IF(SUM(F20,G20)=0,\"\",SUM(F20,G20))","v":5107},2555,2531,{"$f":"IF(SUM(I20,J20)=0,\"\",SUM(I20,J20))","v":5086},{"$f":"IF(SUM(C20,F20,I20)=0,\"\",SUM(C20,F20,I20))","v":7701},{"$f":"IF(SUM(D20,G20,J20)=0,\"\",SUM(SUM(D20,G20,J20)))","v":7589},{"$f":"IF(SUM(L20,M20)=0,\"\",SUM(L20,M20))","v":15290},87,73,{"$f":"IF(SUM(O20,P20)=0,\"\",SUM(O20,P20))","v":160},70,78,{"$f":"IF(SUM(R20,S20)=0,\"\",SUM(R20,S20))","v":148},31,62,{"$f":"IF(SUM(U20,V20)=0,\"\",SUM(U20,V20))","v":93},{"$f":"IF(SUM(O20,R20,U20)=0,\"\",SUM(O20,R20,U20))","v":188},{"$f":"IF(SUM(P20,S20,V20)=0,\"\",SUM(SUM(P20,S20,V20)))","v":213},{"$f":"IF(SUM(X20,Y20)=0,\"\",SUM(X20,Y20))","v":401}]
[null,"TELESECUNDARIAS",935,772,1707,939,798,1737,844,749,1593,2718,2319,5037,28,26,54,16,33,49,18,31,49,62,90,152]
[null,null,null,null,{"$f":"IF(SUM(C22,D22)=0,\"\",SUM(C22,D22))","v":""},null,null,{"$f":"IF(SUM(F22,G22)=0,\"\",SUM(F22,G22))","v":""},null,null,{"$f":"IF(SUM(I22,J22)=0,\"\",SUM(I22,J22))","v":""},{"$f":"IF(SUM(C22,F22,I22)=0,\"\",SUM(C22,F22,I22))","v":""},{"$f":"IF(SUM(D22,G22,J22)=0,\"\",SUM(SUM(D22,G22,J22)))","v":""},{"$f":"IF(SUM(L22,M22)=0,\"\",SUM(L22,M22))","v":""},null,null,{"$f":"IF(SUM(O22,P22)=0,\"\",SUM(O22,P22))","v":""},null,null,{"$f":"IF(SUM(R22,S22)=0,\"\",SUM(R22,S22))","v":""},null,null,{"$f":"IF(SUM(U22,V22)=0,\"\",SUM(U22,V22))","v":""},{"$f":"IF(SUM(O22,R22,U22)=0,\"\",SUM(O22,R22,U22))","v":""},{"$f":"IF(SUM(P22,S22,V22)=0,\"\",SUM(SUM(P22,S22,V22)))","v":""},{"$f":"IF(SUM(X22,Y22)=0,\"\",SUM(X22,Y22))","v":""}]
[null,"TOTAL",{"$f":"IF(SUM(C18:C22)=0,\"\",SUM(C18:C22))","v":7164},6870,14034,6964,6677,13641,6780,6791,13571,20908,20338,41246,190,159,349,140,197,337,79,123,202,409,479,888]
[]
[null,"MODALIDAD","BAJAS",null,null,null,null,null,null,null,null,null,null,null,null,null,null,null,null,null,null,null,null,null,null,null,"EXISTENCIA"]
[null,null,"DESERCIÓN",null,null,null,null,null,null,null,null,null,null,null,"CAMBIOS HACIA OTRAS ESCUELAS (TRASLADOS)"]
[null,null,"PRIMERO",null,null,"SEGUNDO",null,null,"TERCERO",null,null,"TOTAL",null,null,"PRIMERO",null,null,"SEGUNDO",null,null,"TERCERO",null,null,"TOTAL",null,null,"PRIMERO",null,null,"SEGUNDO",null,null,"TERCERO",null,null,"TOTAL"]
[null,null,"H","M","T","H","M","T","H","M","T","H","M","T","H","M","T","H","M","T","H","M","T","H","M","T","H","M","T","H","M","T","H","M","T","H","M","T"]
[null,{"$f":"IF(B18=0,\"\",B18)","v":"GENERALES PÚBLICAS"},1,2,{"$f":"C29+D29","v":3},2,7,{"$f":"F29+G29","v":9},10,18,{"$f":"I29+J29","v":28},{"$f":"C29+F29+I29","v":13},{"$f":"D29+G29+J29","v":27},{"$f":"L29+M29","v":40},53,51,{"$f":"O29+P29","v":104},81,70,{"$f":"R29+S29","v":151},56,43,{"$f":"U29+V29","v":99},{"$f":"O29+R29+U29","v":190},{"$f":"P29+S29+V29","v":164},{"$f":"X29+Y29","v":354},{"$f":"C18+O18-C29-O29","v":2862},{"$f":"D18+P18-D29-P29","v":2796},{"$f":"AA29+AB29","v":5658},{"$f":"F18+R18-F29-R29","v":2757},{"$f":"G18+S18-G29-S29","v":2677},{"$f":"AD29+AE29","v":5434},{"$f":"I18+U18-I29-U29","v":2739},{"$f":"J18+V18-J29-V29","v":2841},{"$f":"AG29+AH29","v":5580},{"$f":"AA29+AD29+AG29","v":8358},{"$f":"AB29+AE29+AH29","v":8314},{"$f":"AJ29+AK29","v":16672}]
[null,{"$f":"IF(B19=0,\"\",B19)","v":"GENERALES PARTICULARES"},1,1,{"$f":"C30+D30","v":2},2,1,{"$f":"F30+G30","v":3},1,0,{"$f":"I30+J30","v":1},{"$f":"C30+F30+I30","v":4},{"$f":"D30+G30+J30","v":2},{"$f":"L30+M30","v":6},12,7,{"$f":"O30+P30","v":19},10,17,{"$f":"R30+S30","v":27},2,12,{"$f":"U30+V30","v":14},{"$f":"O30+R30+U30","v":24},{"$f":"P30+S30+V30","v":36},{"$f":"X30+Y30","v":60},{"$f":"C19+O19-C30-O30","v":808},{"$f":"D19+P19-D30-P30","v":771},{"$f":"AA30+AB30","v":1579},{"$f":"F19+R19-F30-R30","v":648},{"$f":"G19+S19-G30-S30","v":665},{"$f":"AD30+AE30","v":1313},{"$f":"I19+U19-I30-U30","v":603},{"$f":"J19+V19-J30-V30","v":627},1231,{"$f":"AA30+AD30+AG30","v":2059},{"$f":"AB30+AE30+AH30","v":2063},{"$f":"AJ30+AK30","v":4122}]
[null,{"$f":"IF(B20=0,\"\",B20)","v":"SEC TÉCNICAS"},16,7,{"$f":"IF(SUM(C31,D31)=0,\"\",SUM(C31,D31))","v":23},16,12,{"$f":"IF(SUM(F31,G31)=0,\"\",SUM(F31,G31))","v":28},10,14,{"$f":"IF(SUM(I31,J31)=0,\"\",SUM(I31,J31))","v":24},{"$f":"IF(SUM(C31,F31,I31)=0,\"\",SUM(C31,F31,I31))","v":42},{"$f":"IF(SUM(D31,G31,J31)=0,\"\",SUM(SUM(D31,G31,J31)))","v":33},{"$f":"IF(SUM(L31,M31)=0,\"\",SUM(L31,M31))","v":75},81,95,{"$f":"IF(SUM(O31,P31)=0,\"\",SUM(O31,P31))","v":176},69,99,{"$f":"IF(SUM(R31,S31)=0,\"\",SUM(R31,S31))","v":168},45,51,{"$f":"IF(SUM(U31,V31)=0,\"\",SUM(U31,V31))","v":96},{"$f":"IF(SUM(O31,R31,U31)=0,\"\",SUM(O31,R31,U31))","v":195},{"$f":"IF(SUM(P31,S31,V31)=0,\"\",SUM(SUM(P31,S31,V31)))","v":245},{"$f":"IF(SUM(X31,Y31)=0,\"\",SUM(X31,Y31))","v":440},{"$f":"IF(SUM(C20,O20-C31-O31)=0,\"\",SUM(C20,O20-C31-O31))","v":2557},2501,{"$f":"IF(SUM(AA31,AB31)=0,\"\",SUM(AA31,AB31))","v":5058},{"$f":"IF(SUM(F20,R20-F31-R31)=0,\"\",SUM(F20,R20-F31-R31))","v":2564},2495,{"$f":"IF(SUM(AD31,AE31)=0,\"\",SUM(AD31,AE31))","v":5059},{"$f":"IF(SUM(I20,U20-I31-U31)=0,\"\",SUM(I20,U20-I31-U31))","v":2531},2528,{"$f":"IF(SUM(AG31,AH31)=0,\"\",SUM(AG31,AH31))","v":5059},{"$f":"IF(SUM(AA31,AD31,AG31)=0,\"\",SUM(AA31,AD31,AG31))","v":7652},{"$f":"IF(SUM(AB31,AE31,AH31)=0,\"\",SUM(SUM(AB31,AE31,AH31)))","v":7524},{"$f":"IF(SUM(AJ31,AK31)=0,\"\",SUM(AJ31,AK31))","v":15176}]
[null,{"$f":"IF(B21=0,\"\",B21)","v":"TELESECUNDARIAS"},1,5,6,10,7,17,3,4,7,14,16,30,23,24,47,20,25,45,23,23,46,66,72,138,939,769,1708,925,799,1724,836,753,1589,2700,2321,5021]
[null,{"$f":"IF(B22=0,\"\",B22)","v":""},null,null,{"$f":"IF(SUM(C33,D33)=0,\"\",SUM(C33,D33))","v":""},null,null,{"$f":"IF(SUM(F33,G33)=0,\"\",SUM(F33,G33))","v":""},null,null,{"$f":"IF(SUM(I33,J33)=0,\"\",SUM(I33,J33))","v":""},{"$f":"IF(SUM(C33,F33,I33)=0,\"\",SUM(C33,F33,I33))","v":""},{"$f":"IF(SUM(D33,G33,J33)=0,\"\",SUM(SUM(D33,G33,J33)))","v":""},{"$f":"IF(SUM(L33,M33)=0,\"\",SUM(L33,M33))","v":""},null,null,{"$f":"IF(SUM(O33,P33)=0,\"\",SUM(O33,P33))","v":""},null,null,{"$f":"IF(SUM(R33,S33)=0,\"\",SUM(R33,S33))","v":""},null,null,{"$f":"IF(SUM(U33,V33)=0,\"\",SUM(U33,V33))","v":""},{"$f":"IF(SUM(O33,R33,U33)=0,\"\",SUM(O33,R33,U33))","v":""},{"$f":"IF(SUM(P33,S33,V33)=0,\"\",SUM(SUM(P33,S33,V33)))","v":""},{"$f":"IF(SUM(X33,Y33)=0,\"\",SUM(X33,Y33))","v":""},"","",{"$f":"IF(SUM(AA33,AB33)=0,\"\",SUM(AA33,AB33))","v":""},"","",{"$f":"IF(SUM(AD33,AE33)=0,\"\",SUM(AD33,AE33))","v":""},"","",{"$f":"IF(SUM(AG33,AH33)=0,\"\",SUM(AG33,AH33))","v":""},{"$f":"IF(SUM(AA33,AD33,AG33)=0,\"\",SUM(AA33,AD33,AG33))","v":""},{"$f":"IF(SUM(AB33,AE33,AH33)=0,\"\",SUM(SUM(AB33,AE33,AH33)))","v":""},{"$f":"IF(SUM(AJ33,AK33)=0,\"\",SUM(AJ33,AK33))","v":""}]
[null,"TOTAL",{"$f":"IF(SUM(C29:C33)=0,\"\",SUM(C29:C33))","v":19},15,34,30,27,57,24,36,60,73,78,151,169,177,346,180,211,391,126,129,255,475,517,992,7166,6837,14003,6894,6636,13530,6709,6749,13459,20769,20222,40991]

{"sheet":"APROV 1","index":1,"n_rows":33,"n_cols":34,"rows_kept":33,"cut":false,"hidden":false,"merged":[[27,0,27,1],[28,0,28,1],[29,0,29,1],[17,2,17,4],[15,32,15,33],[16,29,16,31],[16,32,16,33],[19,2,19,4],[19,5,19,7],[36,0,63,33],[18,29,18,31],[23,29,23,31],[23,11,23,13],[23,14,23,16],[23,20,23,22],[23,26,23,28],[15,29,15,31],[17,5,17,7],[16,2,16,4],[16,20,16,22],[16,23,16,25],[16,26,16,28],[15,26,15,28],[15,17,15,19],[15,20,15,22],[15,23,15,25],[17,14,17,16],[17,17,17,19],[17,20,17,22],[17,23,17,25],[17,26,17,28],[18,14,18,16],[18,17,18,19],[0,0,0,33],[2,2,2,30],[3,2,3,30],[4,2,4,30],[5,2,5,30],[10,0,10,3],[17,29,17,31],[17,32,17,33],[18,2,18,4],[18,5,18,7],[18,8,18,10],[15,2,15,4],[15,5,15,7],[15,8,15,10],[15,11,15,13],[18,20,18,22],[18,23,18,25],[18,26,18,28],[18,11,18,13],[12,32,13,33],[18,32,18,33],[16,8,16,10],[16,11,16,13],[9,0,9,3],[19,29,19,31],[14,32,14,33],[13,0,14,0],[13,2,13,4],[17,8,17,10],[19,32,19,33],[19,8,19,10],[19,11,19,13],[19,14,19,16],[19,17,19,19],[19,20,19,22],[19,23,19,25],[19,26,19,28],[17,11,17,13],[15,14,15,16],[13,5,13,7],[13,8,13,10],[13,11,13,13],[13,14,13,16],[13,17,13,19],[14,17,14,19],[14,14,14,16],[16,5,16,7],[16,14,16,16],[16,17,16,19],[9,5,9,24],[10,5,10,25],[6,2,6,13],[7,2,7,13],[6,14,6,26],[7,14,7,26],[14,5,14,7],[12,26,12,31],[14,23,14,25],[14,20,14,22],[10,27,10,31],[12,0,12,25],[14,8,14,10],[13,20,13,22],[14,2,14,4],[14,11,14,13],[13,29,13,31],[14,29,14,31],[13,26,13,28],[14,26,14,28],[13,23,13,25],[32,0,34,33],[23,2,23,4],[23,5,23,7],[23,8,23,10],[23,17,23,19],[23,23,23,25],[20,2,20,4],[20,8,20,10],[20,5,20,7],[22,26,22,31],[22,0,22,25],[20,29,20,31],[20,11,20,13],[20,14,20,16],[20,17,20,19],[20,20,20,22],[20,26,20,28],[20,23,20,25],[30,0,30,1],[20,32,20,33],[22,32,23,33],[23,0,24,1],[25,0,25,1],[26,0,26,1]]}
[]
[]
[null,null,"Secretaría de Educación Pública del Estado de Baja California Sur"]
[null,null,"Dirección de Educación Secundaria"]
[null,null,"APROVECHAMIENTO Y RIESGO DE NO ACREDITAR"]
[null,null,"PRIMER GRADO "]
[null,null,"PERIODO EVALUACIÓN:",null,null,null,null,null,null,null,null,null,null,null,{"$f":"IF(MATRICULA!O7=0,\"\",MATRICULA!O7)","v":"CONCENTRADO TERCER PERIODO DE EVALUACIÓN"}]
[null,null,"CICLO ESCOLAR :",null,null,null,null,null,null,null,null,null,null,null,{"$f":"IF(MATRICULA!O8=0,\"\",MATRICULA!O8)","v":"2022-2023"}]
[]
[null,null,null,null,null,{"$f":"MATRICULA!I11","v":"MTRA. OFELIA ELIZABETH OCHOA ROMERO"}]
[null,null,null,null,null,{"$f":"MATRICULA!I12","v":"DIRECCIÓN DE EDUCACIÓN SECUNDARIA"}]
[]
["Promedio de Aprovechamiento de los Campos de Formación Académica",null,null,null,null,null,null,null,null,null,null,null,null,null,null,null,null,null,null,null,null,null,null,null,null,null,"Promedio de Aprovechamiento de las Áreas de Desarrollo Personal y Social",null,null,null,null,null,"Prom. Final"]
["MODALIDAD","GRUPOS","Lengua Materna ",null,null,"Matemáticas",null,null,"Inglés",null,null,"Ciencias y tecnología (Biología)",null,null,"Historia",null,null,"Geografía",null,null,"Formación Cívica y Ética",null,null,"Tecnología I",null,null,"Educación Física",null,null,"Artes"]
[null,null,"CALIF",null,null,"CALIF",null,null,"CALIF",null,null,"CALIF",null,null,"CALIF",null,null,"CALIF",null,null,"CALIF",null,null,"CALIF",null,null,"CALIF",null,null,"CALIF",null,null,"CALIF"]
[{"$f":"IF(MATRICULA!B18=0,\"\",MATRICULA!B18)","v":"GENERALES PÚBLICAS"},186,8.4,null,null,8.1999999999999993,null,null,8.5,null,null,8.6,null,null,8.6,null,null,8.5,null,null,8.6,null,null,8.6999999999999993,null,null,9.4,null,null,8.9,null,null,{"$f":"IFERROR(ROUND(AVERAGE(C16:AF16),1),\"\")","v":8.6}]
[{"$f":"IF(MATRICULA!B19=0,\"\",MATRICULA!B19)","v":"GENERALES PARTICULARES"},113,8.6,null,null,8.4,null,null,8.8000000000000007,null,null,8.6999999999999993,null,null,8.6,null,null,8.9,null,null,8.8000000000000007,null,null,9,null,null,9.5,null,null,9.5,null,null,{"$f":"IFERROR(ROUND(AVERAGE(C17:AF17),1),\"\")","v":8.9}]
[{"$f":"IF(MATRICULA!B20=0,\"\",MATRICULA!B20)","v":"SEC TÉCNICAS"},292,8.4,null,null,8.1999999999999993,null,null,8.4,null,null,8.6,null,null,8.4,null,null,8.5,null,null,8.4,null,null,8.6,null,null,9.4,null,null,9,null,null,8.6]
[{"$f":"IF(MATRICULA!B21=0,\"\",MATRICULA!B21)","v":"TELESECUNDARIAS"},103,8.1999999999999993,null,null,8,null,null,8.3000000000000007,null,null,8.3000000000000007,null,null,8.1999999999999993,null,null,8.1999999999999993,null,null,8.5,null,null,9,null,null,9.1,null,null,9.1,null,null,8.5]
[{"$f":"IF(MATRICULA!B22=0,\"\",MATRICULA!B22)","v":""},null,null,null,null,null,null,null,null,null,null,null,null,null,null,null,null,null,null,null,null,null,null,null,null,null,null,null,null,null,null,null,""]
["Gral.",{"$f":"IF(SUM(B16:B20)=0,\"\",SUM(B16:B20))","v":694},{"$f":"IFERROR(ROUND(AVERAGE(C16:E20),1),\"\")","v":8.4},null,null,{"$f":"IFERROR(ROUND(AVERAGE(F16:H20),1),\"\")","v":8.1999999999999993},null,null,{"$f":"IFERROR(ROUND(AVERAGE(I16:K20),1),\"\")","v":8.5},null,null,{"$f":"IFERROR(ROUND(AVERAGE(L16:N20),1),\"\")","v":8.6},null,null,{"$f":"IFERROR(ROUND(AVERAGE(O16:Q20),1),\"\")","v":8.5},null,null,{"$f":"IFERROR(ROUND(AVERAGE(R16:T20),1),\"\")","v":8.5},null,null,{"$f":"IFERROR(ROUND(AVERAGE(U16:W20),1),\"\")","v":8.6},null,null,{"$f":"IFERROR(ROUND(AVERAGE(X16:Z20),1),\"\")","v":8.8000000000000007},null,null,{"$f":"IFERROR(ROUND(AVERAGE(AA16:AC20),1),\"\")","v":9.4},null,null,{"$f":"IFERROR(ROUND(AVERAGE(AD16:AF20),1),\"\")","v":9.1},null,null,{"$f":"IFERROR(ROUND(AVERAGE(C21:AF21),1),\"\")","v":8.6999999999999993}]
[]
["Campos de Formación Académica en riesgo de no acreditar",null,null,null,null,null,null,null,null,null,null,null,null,null,null,null,null,null,null,null,null,null,null,null,null,null,"Áreas de Desarrollo Personal y Social en situación de riesgo de no acreditar",null,null,null,null,null,"Total"]
["MODALIDAD",null,"Lengua Materna",null,null,"Matemáticas",null,null,"Inglés",null,null,"Ciencias y tecnología (Biología)",null,null,"Historia",null,null,"Geografía",null,null,"Formación Cívica y Ética",null,null,"Tecnología I",null,null,"Educación Física",null,null,"Artes"]
[null,null,5,6,"T",5,6,"T",5,6,"T",5,6,"T",5,6,"T",5,6,"T",5,6,"T",5,6,"T",5,6,"T",5,6,"T",5,6]
[{"$f":"IF(MATRICULA!B18=0,\"\",MATRICULA!B18)","v":"GENERALES PÚBLICAS"},null,137,387,{"$f":"C26+D26","v":524},217,566,{"$f":"F26+G26","v":783},145,422,{"$f":"I26+J26","v":567},162,368,{"$f":"L26+M26","v":530},161,377,{"$f":"O26+P26","v":538},138,382,{"$f":"R26+S26","v":520},114,448,{"$f":"U26+V26","v":562},174,357,{"$f":"X26+Y26","v":531},61,70,{"$f":"AA26+AB26","v":131},78,243,{"$f":"AD26+AE26","v":321},{"$f":"C26+F26+I26+L26+O26+R26+U26+X26+AA26+AD26","v":1387},{"$f":"D26+G26+J26+M26+P26+S26+V26+Y26+AB26+AE26","v":3620}]
[{"$f":"IF(MATRICULA!B19=0,\"\",MATRICULA!B19)","v":"GENERALES PARTICULARES"},null,4,42,{"$f":"C27+D27","v":46},17,68,{"$f":"F27+G27","v":85},6,32,{"$f":"I27+J27","v":38},2,46,{"$f":"L27+M27","v":48},4,41,{"$f":"O27+P27","v":45},3,31,{"$f":"R27+S27","v":34},3,50,{"$f":"U27+V27","v":53},3,38,{"$f":"X27+Y27","v":41},2,11,{"$f":"AA27+AB27","v":13},2,9,{"$f":"AD27+AE27","v":11},{"$f":"C27+F27+I27+L27+O27+R27+U27+X27+AA27+AD27","v":46},{"$f":"D27+G27+J27+M27+P27+S27+V27+Y27+AB27+AE27","v":368}]
[{"$f":"IF(MATRICULA!B20=0,\"\",MATRICULA!B20)","v":"SEC TÉCNICAS"},null,213,435,{"$f":"IF(SUM(C28,D28)=0,\"\",SUM(C28,D28))","v":648},227,530,{"$f":"IF(SUM(F28,G28)=0,\"\",SUM(F28,G28))","v":757},260,489,{"$f":"IF(SUM(I28,J28)=0,\"\",SUM(I28,J28))","v":749},209,508,{"$f":"IF(SUM(L28,M28)=0,\"\",SUM(L28,M28))","v":717},208,559,{"$f":"IF(SUM(O28,P28)=0,\"\",SUM(O28,P28))","v":767},179,389,{"$f":"IF(SUM(R28,S28)=0,\"\",SUM(R28,S28))","v":568},173,559,{"$f":"IF(SUM(U28,V28)=0,\"\",SUM(U28,V28))","v":732},159,394,{"$f":"IF(SUM(X28,Y28)=0,\"\",SUM(X28,Y28))","v":553},52,77,{"$f":"IF(SUM(AA28,AB28)=0,\"\",SUM(AA28,AB28))","v":129},107,296,{"$f":"IF(SUM(AD28,AE28)=0,\"\",SUM(AD28,AE28))","v":403},{"$f":"IF(SUM(C28,F28,I28,L28,O28,R28,U28,X28,AA28,AD28)=0,\"\",SUM(C28,F28,I28,L28,O28,R28,U28,X28,AA28,AD28))","v":1787},{"$f":"IF(SUM(D28,G28,J28,M28,P28,S28,V28,Y28,AB28,AE28)=0,\"\",SUM(D28,G28,J28,M28,P28,S28,V28,Y28,AB28,AE28))","v":4236}]
[{"$f":"IF(MATRICULA!B21=0,\"\",MATRICULA!B21)","v":"TELESECUNDARIAS"},null,25,135,160,33,192,225,47,154,201,24,141,165,30,154,184,38,140,178,27,105,132,28,52,80,22,39,61,26,60,86,300,1172]
[{"$f":"IF(MATRICULA!B22=0,\"\",MATRICULA!B22)","v":""},null,null,null,"",null,null,"",null,null,"",null,null,"",null,null,"",null,null,"",null,null,"",null,null,"",null,null,"",null,null,"","",""]
["Total",null,{"$f":"IF(SUM(C26:C30)=0,\"\",SUM(C26:C30))","v":379},999,1378,494,1356,1850,458,1097,1555,397,1063,1460,403,1131,1534,358,942,1300,317,1162,1479,364,841,1205,137,197,334,213,608,821,3520,9396]
[]
["Nota: Para las columnas \"Campos de Formación Académica y Áreas de Desarrollo Personal y Social en riesgo de no acreditar\" registre la cantidad de cincos o seis que existen en cada campo o área."]

{"sheet":"Gráfica APROV 1","index":2,"n_rows":18,"n_cols":14,"rows_kept":18,"cut":false,"hidden":false,"merged":[[6,1,6,12],[5,13,5,25],[6,13,6,25],[0,0,0,32],[2,1,2,29],[3,1,3,29],[4,1,4,29],[5,1,5,12],[8,7,8,20],[9,7,9,20],[9,0,9,6],[8,0,8,6],[33,0,47,32]]}
[]
[]
[null,"Secretaría de Educación Pública del Estado de Baja California Sur"]
[null,"Dirección de Educación Secundaria"]
[null,"PRIMER GRADO "]
[null,"PERIODO EVALUACIÓN:",null,null,null,null,null,null,null,null,null,null,null,{"$f":"MATRICULA!$O$7","v":"CONCENTRADO TERCER PERIODO DE EVALUACIÓN"}]
[null,"CICLO ESCOLAR :",null,null,null,null,null,null,null,null,null,null,null,{"$f":"MATRICULA!$O$8","v":"2022-2023"}]
[]
[null,null,null,null,null,null,null,{"$f":"MATRICULA!I11","v":"MTRA. OFELIA ELIZABETH OCHOA ROMERO"}]
[null,null,null,null,null,null,null,{"$f":"MATRICULA!I12","v":"DIRECCIÓN DE EDUCACIÓN SECUNDARIA"}]
[]
[]
[]
[]
[]
[]
[null,"Lengua Materna","Matemáticas","Inglés","Ciencias y tecnología (Biología)","Historia","Geografía","Formación Cívica y Ética","Tecnología I","Educación Física","Artes"]
[null,{"$f":"'APROV 1'!C21","v":8.4},{"$f":"'APROV 1'!F21","v":8.1999999999999993},{"$f":"'APROV 1'!I21","v":8.5},{"$f":"'APROV 1'!L21","v":8.6},{"$f":"'APROV 1'!O21","v":8.5},{"$f":"'APROV 1'!R21","v":8.5},{"$f":"'APROV 1'!U21","v":8.6},{"$f":"'APROV 1'!X21","v":8.8000000000000007},{"$f":"'APROV 1'!AA21","v":9.4},{"$f":"'APROV 1'!AD21","v":9.1}]

{"sheet":"APROV 2","index":3,"n_rows":37,"n_cols":31,"rows_kept":37,"cut":false,"hidden":false,"merged":[[17,23,17,25],[18,23,18,25],[18,2,18,4],[21,2,21,4],[23,2,23,4],[23,17,23,19],[20,11,20,13],[20,14,20,16],[20,17,20,19],[20,20,20,22],[3,2,3,27],[4,2,4,27],[5,2,5,27],[6,2,6,27],[7,14,7,24],[8,14,8,24],[7,2,7,13],[8,2,8,13],[12,0,12,7],[12,8,12,24],[17,17,17,19],[24,23,24,25],[24,11,24,13],[18,11,18,13],[17,11,17,13],[27,26,27,28],[27,14,27,16],[24,20,24,22],[36,0,37,30],[24,14,24,16],[24,26,24,28],[24,17,24,19],[24,2,24,4],[27,29,27,30],[24,29,24,30],[24,5,24,7],[24,8,24,10],[27,2,27,4],[27,5,27,7],[27,8,27,10],[27,17,27,19],[27,23,27,25],[27,11,27,13],[18,5,18,7],[23,23,23,25],[23,26,23,28],[22,26,22,28],[34,0,34,1],[29,0,29,1],[27,0,28,1],[30,0,30,1],[31,0,31,1],[18,29,18,30],[19,5,19,7],[21,5,21,7],[23,5,23,7],[23,11,23,13],[23,14,23,16],[20,8,20,10],[32,0,32,1],[33,0,33,1],[23,8,23,10],[27,20,27,22],[26,0,26,22],[16,29,16,30],[26,23,26,28],[26,29,26,30],[38,0,49,30],[18,8,18,10],[17,20,17,22],[18,14,18,16],[18,17,18,19],[18,20,18,22],[17,29,17,30],[17,0,18,0],[17,2,17,4],[17,5,17,7],[17,8,17,10],[17,26,17,28],[18,26,18,28],[19,2,19,4],[19,8,19,10],[19,29,19,30],[20,2,20,4],[20,5,20,7],[22,29,22,30],[23,29,23,30],[23,20,23,22],[20,29,20,30],[21,8,21,10],[21,11,21,13],[21,14,21,16],[21,17,21,19],[21,20,21,22],[21,23,21,25],[21,26,21,28],[21,29,21,30],[13,0,13,7],[13,8,13,24],[22,2,22,4],[22,5,22,7],[22,8,22,10],[22,11,22,13],[22,14,22,16],[22,17,22,19],[22,20,22,22],[22,23,22,25],[16,23,16,28],[19,11,19,13],[19,14,19,16],[19,17,19,19],[19,20,19,22],[19,23,19,25],[19,26,19,28],[16,0,16,22],[17,1,18,1],[20,23,20,25],[20,26,20,28],[14,5,14,11],[14,13,14,14],[17,14,17,16]]}
[]
[]
[]
[null,null,"Secretaría de Educación Pública del Estado de Baja California Sur"]
[null,null,"Dirección de Educación Secundaria"]
[null,null,"APROVECHAMIENTO Y RIESGO DE NO ACREDITAR"]
[null,null,"SEGUNDO GRADO"]
[null,null,"PERIODO EVALUACIÓN:",null,null,null,null,null,null,null,null,null,null,null,{"$f":"IF('APROV 1'!O7:AA7<>0,'APROV 1'!O7:AA7, \"\")","v":"CONCENTRADO TERCER PERIODO DE EVALUACIÓN"}]
[null,null,"CICLO ESCOLAR :",null,null,null,null,null,null,null,null,null,null,null,{"$f":"IF('APROV 1'!O8:AA8<>0, 'APROV 1'!O8:AA8, \"\")","v":"2022-2023"}]
[]
[]
[]
[null,null,null,null,null,null,null,null,{"$f":"MATRICULA!I11","v":"MTRA. OFELIA ELIZABETH OCHOA ROMERO"}]
[null,null,null,null,null,null,null,null,{"$f":"MATRICULA!I12","v":"DIRECCIÓN DE EDUCACIÓN SECUNDARIA"}]
[]
[]
["Promedio de Aprovechamiento de los Campos de Formación Académica",null,null,null,null,null,null,null,null,null,null,null,null,null,null,null,null,null,null,null,null,null,null,"Promedio de Aprovechamiento de las Áreas de Desarrollo Personal y Social"]
["MODALIDAD","GRUPOS","Lengua Materna",null,null,"Matemáticas",null,null,"Inglés",null,null,"Ciencias y tecnología (Física)",null,null,"Historia ",null,null,"Formación Cívica y Ética",null,null,"Tecnología II",null,null,"Educación Física",null,null,"Artes",null,null,"Prom. Final"]
[null,null,"CALIF",null,null,"CALIF",null,null,"CALIF",null,null,"CALIF",null,null,"CALIF",null,null,"CALIF",null,null,"CALIF",null,null,"CALIF",null,null,"CALIF",null,null,"CALIF"]
[{"$f":"IF(MATRICULA!B18=0,\"\",MATRICULA!B18)","v":"GENERALES PÚBLICAS"},186,8.4,null,null,8.1999999999999993,null,null,8.6,null,null,8.4,null,null,8.6,null,null,8.6999999999999993,null,null,8.8000000000000007,null,null,9.5,null,null,8.8000000000000007,null,null,{"$f":"IFERROR(ROUND(AVERAGE(C20:AC20),1),\"\")","v":8.6999999999999993}]
[{"$f":"IF(MATRICULA!B19=0,\"\",MATRICULA!B19)","v":"GENERALES PARTICULARES"},94,8.8000000000000007,null,null,8.6,null,null,8.9,null,null,8.8000000000000007,null,null,8.8000000000000007,null,null,8.9,null,null,9.1,null,null,9.6,null,null,9.4,null,null,9]
[{"$f":"IF(MATRICULA!B20=0,\"\",MATRICULA!B20)","v":"SEC TÉCNICAS"},307,8.5,null,null,8.1,null,null,8.4,null,null,8.5,null,null,8.4,null,null,8.5,null,null,8.6999999999999993,null,null,9.3000000000000007,null,null,9,null,null,8.6]
[{"$f":"IF(MATRICULA!B21=0,\"\",MATRICULA!B21)","v":"TELESECUNDARIAS"},103,8.4,null,null,8.1999999999999993,null,null,8.4,null,null,8.4,null,null,8.4,null,null,8.6,null,null,9.1,null,null,9.3000000000000007,null,null,9.1999999999999993,null,null,8.6999999999999993]
[{"$f":"IF(MATRICULA!B22=0,\"\",MATRICULA!B22)","v":""},null,null,null,null,null,null,null,null,null,null,null,null,null,null,null,null,null,null,null,null,null,null,null,null,null,null,null,null,""]
["Gral.",{"$f":"IF(SUM(B20:B24)=0,\"\",SUM(B20:B24))","v":690},{"$f":"IFERROR(ROUND(AVERAGE(C20:E24),1),\"\")","v":8.5},null,null,{"$f":"IFERROR(ROUND(AVERAGE(F20:H24),1),\"\")","v":8.3000000000000007},null,null,{"$f":"IFERROR(ROUND(AVERAGE(I20:K24),1),\"\")","v":8.6},null,null,{"$f":"IFERROR(ROUND(AVERAGE(L20:N24),1),\"\")","v":8.5},null,null,{"$f":"IFERROR(ROUND(AVERAGE(O20:Q24),1),\"\")","v":8.6},null,null,{"$f":"IFERROR(ROUND(AVERAGE(R20:T24),1),\"\")","v":8.6999999999999993},null,null,{"$f":"IFERROR(ROUND(AVERAGE(U20:W24),1),\"\")","v":8.9},null,null,{"$f":"IFERROR(ROUND(AVERAGE(X20:Z24),1),\"\")","v":9.4},null,null,{"$f":"IFERROR(ROUND(AVERAGE(AA20:AC24),1),\"\")","v":9.1},null,null,{"$f":"IFERROR(ROUND(AVERAGE(C25:AC25),1),\"\")","v":8.6999999999999993}]
[]
["Campos de Formación Académica en situacion de riesgo de no acreditar",null,null,null,null,null,null,null,null,null,null,null,null,null,null,null,null,null,null,null,null,null,null,"Áreas de Desarrollo Personal y Social en situación de riesgo de no acreditar"]
["MODALIDAD",null,"Lengua Materna",null,null,"Matemáticas",null,null,"Inglés",null,null,"Ciencias y tecnología (Física)",null,null,"Historia ",null,null,"Formación Cívica y Ética",null,null,"Tecnología II",null,null,"Educación Física",null,null,"Artes",null,null,"Total"]
[null,null,5,6,"T",5,6,"T",5,6,"T",5,6,"T",5,6,"T",5,6,"T",5,6,"T",5,6,"T",5,6,"T",5,6]
[{"$f":"IF(MATRICULA!B18=0,\"\",MATRICULA!B18)","v":"GENERALES PÚBLICAS"},null,118,347,{"$f":"C30+D30","v":465},229,558,{"$f":"F30+G30","v":787},122,403,{"$f":"I30+J30","v":525},160,485,{"$f":"L30+M30","v":645},222,393,{"$f":"O30+P30","v":615},102,391,{"$f":"R30+S30","v":493},185,253,{"$f":"U30+V30","v":438},63,104,{"$f":"X30+Y30","v":167},101,291,{"$f":"AA30+AB30","v":392},{"$f":"C30+F30+I30+L30+O30+R30+U30+X30+AA30","v":1302},{"$f":"D30+G30+J30+M30+P30+S30+V30+Y30+AB30","v":3225}]
[{"$f":"IF(MATRICULA!B19=0,\"\",MATRICULA!B19)","v":"GENERALES PARTICULARES"},null,6,32,{"$f":"C31+D31","v":38},18,73,{"$f":"F31+G31","v":91},4,40,{"$f":"I31+J31","v":44},7,44,{"$f":"L31+M31","v":51},4,16,{"$f":"O31+P31","v":20},0,45,{"$f":"R31+S31","v":45},4,40,{"$f":"U31+V31","v":44},1,12,13,0,24,24,{"$f":"C31+F31+I31+L31+O31+R31+U31+X31+AA31","v":44},{"$f":"D31+G31+J31+M31+P31+S31+V31+Y31+AB31","v":326}]
[{"$f":"IF(MATRICULA!B20=0,\"\",MATRICULA!B20)","v":"SEC TÉCNICAS"},null,176,362,{"$f":"IF(SUM(C32,D32)=0,\"\",SUM(C32,D32))","v":538},253,659,{"$f":"IF(SUM(F32,G32)=0,\"\",SUM(F32,G32))","v":912},277,442,{"$f":"IF(SUM(I32,J32)=0,\"\",SUM(I32,J32))","v":719},194,477,{"$f":"IF(SUM(L32,M32)=0,\"\",SUM(L32,M32))","v":671},212,472,{"$f":"IF(SUM(O32,P32)=0,\"\",SUM(O32,P32))","v":684},157,536,{"$f":"IF(SUM(R32,S32)=0,\"\",SUM(R32,S32))","v":693},176,366,{"$f":"IF(SUM(U32,V32)=0,\"\",SUM(U32,V32))","v":542},102,72,{"$f":"IF(SUM(X32,Y32)=0,\"\",SUM(X32,Y32))","v":174},99,201,{"$f":"IF(SUM(AA32,AB32)=0,\"\",SUM(AA32,AB32))","v":300},{"$f":"IF(SUM(C32,F32,I32,L32,O32,R32,U32,X32,AA32)=0,\"\",SUM(C32,F32,I32,L32,O32,R32,U32,X32,AA32))","v":1646},{"$f":"IF(SUM(D32,G32,J32,M32,P32,S32,V32,Y32,AB32)=0,\"\",SUM(D32,G32,J32,M32,P32,S32,V32,Y32,AB32))","v":3587}]
[{"$f":"IF(MATRICULA!B21=0,\"\",MATRICULA!B21)","v":"TELESECUNDARIAS"},null,41,127,168,45,147,192,38,134,172,40,153,193,44,145,189,43,104,147,42,73,115,28,33,61,46,69,115,367,985]
[{"$f":"IF(MATRICULA!B22=0,\"\",MATRICULA!B22)","v":""},null,null,null,"",null,null,"",null,null,"",null,null,"",null,null,"",null,null,"",null,null,"",null,null,"",null,null,"","",""]
["Total",null,{"$f":"IF(SUM(C30:C34)=0,\"\",SUM(C30:C34))","v":341},868,1209,545,1437,1982,441,1019,1460,401,1159,1560,482,1026,1508,302,1076,1378,407,732,1139,194,221,415,246,585,831,3359,8123]
[]
["Nota: Para las columnas \"Campos de Formación Académica y Áreas de Desarrollo Personal y Social en riesgo de no acreditar\" registre la cantidad de cincos o seis que existen en cada campo o área."]

{"sheet":"Gráfica APROV 2","index":4,"n_rows":13,"n_cols":14,"rows_kept":13,"cut":false,"hidden":false,"merged":[[6,1,6,12],[6,13,6,25],[0,0,0,32],[2,1,2,29],[3,1,3,29],[4,1,4,29],[5,1,5,12],[5,13,5,25],[8,0,8,7],[8,9,8,25],[9,26,9,30],[9,9,9,25],[9,0,9,7]]}
[]
[]
[null,"Secretaría de Educación Pública del Estado de Baja California Sur"]
[null,"Dirección de Educación Secundaria"]
[null,"SEGUNDO GRADO"]
[null,"PERIODO EVALUACIÓN:",null,null,null,null,null,null,null,null,null,null,null,{"$f":"MATRICULA!O7","v":"CONCENTRADO TERCER PERIODO DE EVALUACIÓN"}]
[null,"CICLO ESCOLAR :",null,null,null,null,null,null,null,null,null,null,null,{"$f":"MATRICULA!O8","v":"2022-2023"}]
[]
[null,null,null,null,null,null,null,null,null,{"$f":"MATRICULA!I11","v":"MTRA. OFELIA ELIZABETH OCHOA ROMERO"}]
[null,null,null,null,null,null,null,null,null,{"$f":"MATRICULA!I12","v":"DIRECCIÓN DE EDUCACIÓN SECUNDARIA"}]
[]
[null,"Lengua Materna","Matemáticas","Inglés","Ciencias y tecnología (Física)","Historia ","Formación Cívica y Ética ","Tecnología II","Educación Física","Artes"]
[null,{"$f":"'APROV 2'!C25","v":8.5},{"$f":"'APROV 2'!F25","v":8.3000000000000007},{"$f":"'APROV 2'!I25","v":8.6},{"$f":"'APROV 2'!L25","v":8.5},{"$f":"'APROV 2'!O25","v":8.6},{"$f":"'APROV 2'!R25","v":8.6999999999999993},{"$f":"'APROV 2'!U25","v":8.9},{"$f":"'APROV 2'!X25","v":9.4},{"$f":"'APROV 2'!AA25","v":9.1}]

{"sheet":"APROV 3","index":5,"n_rows":32,"n_cols":31,"rows_kept":32,"cut":false,"hidden":false,"merged":[[12,29,13,30],[23,0,24,1],[25,0,25,1],[26,0,26,1],[27,0,27,1],[28,0,28,1],[29,0,29,1],[22,29,22,30],[23,26,23,28],[23,29,23,30],[20,29,20,30],[20,26,20,28],[13,26,13,28],[14,26,14,28],[12,23,12,28],[14,29,14,30],[15,29,15,30],[16,29,16,30],[17,29,17,30],[18,29,18,30],[19,29,19,30],[31,0,32,30],[14,5,14,7],[14,11,14,13],[23,2,23,4],[23,5,23,7],[23,8,23,10],[23,11,23,13],[23,14,23,16],[22,23,22,28],[30,0,30,1],[17,23,17,25],[20,14,20,16],[13,2,13,4],[13,5,13,7],[20,5,20,7],[20,2,20,4],[20,8,20,10],[14,8,14,10],[15,5,15,7],[17,2,17,4],[17,5,17,7],[19,2,19,4],[19,5,19,7],[13,11,13,13],[14,2,14,4],[13,8,13,10],[23,17,23,19],[23,23,23,25],[13,23,13,25],[14,23,14,25],[12,0,12,22],[23,20,23,22],[22,0,22,22],[13,20,13,22],[14,20,14,22],[15,2,15,4],[19,8,19,10],[19,11,19,13],[20,17,20,19],[20,23,20,25],[20,11,20,13],[20,20,20,22],[13,0,14,0],[14,14,14,16],[13,1,14,1],[16,23,16,25],[15,8,15,10],[15,11,15,13],[15,14,15,16],[15,17,15,19],[17,8,17,10],[17,11,17,13],[17,14,17,16],[17,17,17,19],[2,2,2,27],[3,2,3,27],[5,2,5,27],[6,2,6,13],[7,2,7,13],[6,14,6,24],[4,2,4,27],[9,0,9,7],[9,8,9,24],[7,14,7,24],[10,0,10,7],[10,8,10,24],[11,5,11,11],[11,13,11,14],[15,20,15,22],[15,23,15,25],[13,14,13,16],[13,17,13,19],[14,17,14,19],[17,20,17,22],[19,17,19,19],[19,20,19,22],[19,23,19,25],[19,26,19,28],[19,14,19,16],[15,26,15,28],[16,2,16,4],[16,5,16,7],[16,8,16,10],[16,11,16,13],[16,14,16,16],[16,17,16,19],[16,20,16,22],[16,26,16,28],[17,26,17,28],[18,2,18,4],[18,5,18,7],[18,8,18,10],[18,11,18,13],[18,14,18,16],[18,17,18,19],[18,20,18,22],[18,23,18,25],[18,26,18,28]]}
[]
[]
[null,null,"Secretaría de Educación Pública del Estado de Baja California Sur"]
[null,null,"Dirección de Educación Secundaria"]
[null,null,"APROVECHAMIENTO Y RIESGO DE NO ACREDITAR"]
[null,null,"TERCER GRADO"]
[null,null,"PERIODO EVALUACIÓN:",null,null,null,null,null,null,null,null,null,null,null,{"$f":"IF('APROV 1'!O7:AA7<>0,'APROV 1'!O7:AA7, \"\")","v":"CONCENTRADO TERCER PERIODO DE EVALUACIÓN"}]
[null,null,"CICLO ESCOLAR :",null,null,null,null,null,null,null,null,null,null,null,{"$f":"IF('APROV 1'!O8:AA8<>0, 'APROV 1'!O8:AA8, \"\")","v":"2022-2023"}]
[]
[null,null,null,null,null,null,null,null,{"$f":"MATRICULA!I11","v":"MTRA. OFELIA ELIZABETH OCHOA ROMERO"}]
[null,null,null,null,null,null,null,null,{"$f":"MATRICULA!I12","v":"DIRECCIÓN DE EDUCACIÓN SECUNDARIA"}]
[]
["Promedio de Aprovechamiento de los Campos de Formación Académica",null,null,null,null,null,null,null,null,null,null,null,null,null,null,null,null,null,null,null,null,null,null,"Promedio de Aprovechamiento de las Áreas de Desarrollo Personal y Social",null,null,null,null,null,"Prom. Final"]
["MODALIDAD","GRUPOS","Español III",null,null,"Matemáticas III",null,null,"Segunda Lengua: Inglés III",null,null,"Ciencias III (Énfasis en Química)",null,null,"Historia II",null,null,"Formación Cívica y Ética II",null,null,"Tecnología III",null,null,"Educación Física III",null,null,"Artes III"]
[null,null,"CALIF",null,null,"CALIF",null,null,"CALIF",null,null,"CALIF",null,null,"CALIF",null,null,"CALIF",null,null,"CALIF",null,null,"CALIF",null,null,"CALIF",null,null,"CALIF"]
[{"$f":"IF(MATRICULA!B18=0,\"\",MATRICULA!B18)","v":"GENERALES PÚBLICAS"},184,8.6,null,null,8.3000000000000007,null,null,8.6999999999999993,null,null,8.6,null,null,8.6999999999999993,null,null,8.6,null,null,8.8000000000000007,null,null,9.6,null,null,8.9,null,null,{"$f":"IFERROR(ROUND(AVERAGE(C16:AC16),1),\"\")","v":8.8000000000000007}]
[{"$f":"IF(MATRICULA!B19=0,\"\",MATRICULA!B19)","v":"GENERALES PARTICULARES"},92,8.8000000000000007,null,null,8.6,null,null,9,null,null,8.8000000000000007,null,null,8.9,null,null,9.1,null,null,9.4,null,null,9.6,null,null,9.6,null,null,9.1]
[{"$f":"IF(MATRICULA!B20=0,\"\",MATRICULA!B20)","v":"SEC TÉCNICAS"},291,8.6,null,null,8.1999999999999993,null,null,8.5,null,null,8.6,null,null,8.6,null,null,8.6,null,null,8.8000000000000007,null,null,9.4,null,null,9.1,null,null,8.6999999999999993]
[{"$f":"IF(MATRICULA!B21=0,\"\",MATRICULA!B21)","v":"TELESECUNDARIAS"},102,8.5,null,null,8.4,null,null,8.6,null,null,8.5,null,null,8.6,null,null,8.8000000000000007,null,null,9.1,null,null,9.3000000000000007,null,null,9.1,null,null,8.8000000000000007]
[{"$f":"IF(MATRICULA!B22=0,\"\",MATRICULA!B22)","v":""},null,null,null,null,null,null,null,null,null,null,null,null,null,null,null,null,null,null,null,null,null,null,null,null,null,null,null,null,""]
["Gral.",{"$f":"IF(SUM(B16:B20)=0,\"\",SUM(B16:B20))","v":669},{"$f":"IFERROR(ROUND(AVERAGE(C16:E20),1),\"\")","v":8.6},null,null,{"$f":"IFERROR(ROUND(AVERAGE(F16:H20),1),\"\")","v":8.4},null,null,{"$f":"IFERROR(ROUND(AVERAGE(I16:K20),1),\"\")","v":8.6999999999999993},null,null,{"$f":"IFERROR(ROUND(AVERAGE(L16:N20),1),\"\")","v":8.6},null,null,{"$f":"IFERROR(ROUND(AVERAGE(O16:Q20),1),\"\")","v":8.6999999999999993},null,null,{"$f":"IFERROR(ROUND(AVERAGE(R16:T20),1),\"\")","v":8.8000000000000007},null,null,{"$f":"IFERROR(ROUND(AVERAGE(U16:W20),1),\"\")","v":9},null,null,{"$f":"IFERROR(ROUND(AVERAGE(X16:Z20),1),\"\")","v":9.5},null,null,{"$f":"IFERROR(ROUND(AVERAGE(AA16:AC20),1),\"\")","v":9.1999999999999993},null,null,{"$f":"IFERROR(ROUND(AVERAGE(C21:AC21),1),\"\")","v":8.8000000000000007}]
[]
["Campos de Formación Académica en situacion de riesgo de no acreditar",null,null,null,null,null,null,null,null,null,null,null,null,null,null,null,null,null,null,null,null,null,null,"Áreas de Desarrollo Personal y Social en situación de riesgo de no acreditar"]
["MODALIDAD",null,"Español III",null,null,"Matemáticas III",null,null,"Segunda Lengua: Inglés III",null,null,"Ciencias III (Énfasis en Química)",null,null,"Historia II",null,null,"Formación Cívica y Ética II",null,null,"Tecnología III",null,null,"Educación Física III",null,null,"Artes III",null,null,"Total"]
[null,null,5,6,"T",5,6,"T",5,6,"T",5,6,"T",5,6,"T",5,6,"T",5,6,"T",5,6,"T",5,6,"T",5,6]
[{"$f":"IF(MATRICULA!B18=0,\"\",MATRICULA!B18)","v":"GENERALES PÚBLICAS"},null,108,339,{"$f":"C26+D26","v":447},177,577,{"$f":"F26+G26","v":754},153,440,{"$f":"I26+J26","v":593},124,422,{"$f":"L26+M26","v":546},138,330,{"$f":"O26+P26","v":468},95,335,{"$f":"R26+S26","v":430},154,307,{"$f":"U26+V26","v":461},82,58,{"$f":"X26+Y26","v":140},90,304,{"$f":"AA26+AB26","v":394},{"$f":"C26+F26+I26+L26+O26+R26+U26+X26+AA26","v":1121},{"$f":"D26+G26+J26+M26+P26+S26+V26+Y26+AB26","v":3112}]
[{"$f":"IF(MATRICULA!B19=0,\"\",MATRICULA!B19)","v":"GENERALES PARTICULARES"},null,7,29,{"$f":"C27+D27","v":36},8,47,{"$f":"F27+G27","v":55},7,42,{"$f":"I27+J27","v":49},10,51,{"$f":"L27+M27","v":61},5,20,{"$f":"O27+P27","v":25},3,29,{"$f":"R27+S27","v":32},1,27,{"$f":"U27+V27","v":28},1,7,{"$f":"X27+Y27","v":8},9,22,{"$f":"AA27+AB27","v":31},{"$f":"C27+F27+I27+L27+O27+R27+U27+X27+AA27","v":51},{"$f":"D27+G27+J27+M27+P27+S27+V27+Y27+AB27","v":274}]
[{"$f":"IF(MATRICULA!B20=0,\"\",MATRICULA!B20)","v":"SEC TÉCNICAS"},null,171,309,{"$f":"IF(SUM(C28,D28)=0,\"\",SUM(C28,D28))","v":480},233,566,{"$f":"IF(SUM(F28,G28)=0,\"\",SUM(F28,G28))","v":799},233,312,{"$f":"IF(SUM(I28,J28)=0,\"\",SUM(I28,J28))","v":545},167,431,{"$f":"IF(SUM(L28,M28)=0,\"\",SUM(L28,M28))","v":598},133,369,{"$f":"IF(SUM(O28,P28)=0,\"\",SUM(O28,P28))","v":502},121,392,{"$f":"IF(SUM(R28,S28)=0,\"\",SUM(R28,S28))","v":513},152,301,{"$f":"IF(SUM(U28,V28)=0,\"\",SUM(U28,V28))","v":453},95,103,{"$f":"IF(SUM(X28,Y28)=0,\"\",SUM(X28,Y28))","v":198},102,165,{"$f":"IF(SUM(AA28,AB28)=0,\"\",SUM(AA28,AB28))","v":267},{"$f":"IF(SUM(C28,F28,I28,L28,O28,R28,U28,X28,AA28)=0,\"\",SUM(C28,F28,I28,L28,O28,R28,U28,X28,AA28))","v":1407},{"$f":"IF(SUM(D28,G28,J28,M28,P28,S28,V28,Y28,AB28)=0,\"\",SUM(D28,G28,J28,M28,P28,S28,V28,Y28,AB28))","v":2948}]
[{"$f":"IF(MATRICULA!B21=0,\"\",MATRICULA!B21)","v":"TELESECUNDARIAS"},null,34,59,93,25,116,141,23,77,100,32,98,130,23,71,94,34,68,102,23,49,72,17,30,47,20,46,66,231,614]
[{"$f":"IF(MATRICULA!B22=0,\"\",MATRICULA!B22)","v":""},null,null,null,"",null,null,"",null,null,"",null,null,"",null,null,"",null,null,"",null,null,"",null,null,"",null,null,"","",""]
["Total",null,{"$f":"IF(SUM(C26:C30)=0,\"\",SUM(C26:C30))","v":320},736,1056,443,1306,1749,416,871,1287,333,1002,1335,299,790,1089,253,824,1077,330,684,1014,195,198,393,221,537,758,2810,6948]
["Nota: Para las columnas \"Campos de Formación Académica y Áreas de Desarrollo Personal y Social en riesgo de no acreditar\" registre la cantidad de cincos o seis que existen en cada campo o área."]

{"sheet":"Gráfica APROV 3","index":6,"n_rows":13,"n_cols":14,"rows_kept":13,"cut":false,"hidden":false,"merged":[[6,13,6,23],[0,0,0,32],[2,1,2,29],[3,1,3,29],[4,1,4,29],[5,1,5,12],[6,1,6,12],[5,13,5,26],[9,26,9,30],[8,0,8,7],[9,0,9,8],[9,9,9,24],[8,9,8,24]]}
[]
[]
[null,"Secretaría de Educación Pública del Estado de Baja California Sur"]
[null,"Dirección de Educación Secundaria"]
[null,"TERCER GRADO"]
[null,"PERIODO EVALUACIÓN:",null,null,null,null,null,null,null,null,null,null,null,{"$f":"MATRICULA!O7","v":"CONCENTRADO TERCER PERIODO DE EVALUACIÓN"}]
[null,"CICLO ESCOLAR :",null,null,null,null,null,null,null,null,null,null,null,{"$f":"MATRICULA!O8","v":"2022-2023"}]
[]
[null,null,null,null,null,null,null,null,null,{"$f":"MATRICULA!I11","v":"MTRA. OFELIA ELIZABETH OCHOA ROMERO"}]
[null,null,null,null,null,null,null,null,null,{"$f":"MATRICULA!I12","v":"DIRECCIÓN DE EDUCACIÓN SECUNDARIA"}]
[]
[null,"Español III","Matemáticas III","Segunda Lengua: Inglés III","Ciencias III (Énfasis en Química)","Historia II","Formación Cívica y Ética II","Tecnología III","Educación Física III","Artes III"]
[null,{"$f":"'APROV 3'!C21","v":8.6},{"$f":"'APROV 3'!F21","v":8.4},{"$f":"'APROV 3'!I21","v":8.6999999999999993},{"$f":"'APROV 3'!L21","v":8.6},{"$f":"'APROV 3'!O21","v":8.6999999999999993},{"$f":"'APROV 3'!R21","v":8.8000000000000007},{"$f":"'APROV 3'!U21","v":9},{"$f":"'APROV 3'!X21","v":9.5},{"$f":"'APROV 3'!AA21","v":9.1999999999999993}]

{"sheet":"Gráfica Promedios Finales","index":7,"n_rows":15,"n_cols":14,"rows_kept":15,"cut":false,"hidden":false,"merged":[[0,0,0,31],[2,1,2,29],[3,1,3,29],[4,1,4,12],[5,1,5,12],[5,13,5,25],[25,0,105,31],[8,0,8,6],[8,8,8,25],[7,0,7,7],[7,8,7,25]]}
[]
[]
[null,"Secretaría de Educación Pública del Estado de Baja California Sur"]
[null,"Dirección de Educación Secundaria"]
[null,"PERIODO DE EVALUACIÓN:",null,null,null,null,null,null,null,null,null,null,null,{"$f":"MATRICULA!O7","v":"CONCENTRADO TERCER PERIODO DE EVALUACIÓN"}]
[null,"CICLO ESCOLAR :",null,null,null,null,null,null,null,null,null,null,null,{"$f":"MATRICULA!O8","v":"2022-2023"}]
[]
[null,null,null,null,null,null,null,null,{"$f":"MATRICULA!I11","v":"MTRA. OFELIA ELIZABETH OCHOA ROMERO"}]
[null,null,null,null,null,null,null,null,{"$f":"MATRICULA!I12","v":"DIRECCIÓN DE EDUCACIÓN SECUNDARIA"}]
[]
[]
[]
[]
[null,"PROMEDIO 1RO","PROMEDIO 2DO","PROMEDIO 3ERO"]
[null,{"$f":"+'APROV 1'!AG21","v":8.6999999999999993},{"$f":"+'APROV 2'!AD25","v":8.6999999999999993},{"$f":"'APROV 3'!AD21","v":8.8000000000000007}]

{"sheet":"NORMALIDAD MÍNIMA","index":8,"n_rows":45,"n_cols":18,"rows_kept":45,"cut":false,"hidden":false,"merged":[[46,0,62,17],[37,0,37,17],[45,0,45,17],[38,0,38,10],[42,0,42,10],[42,11,42,16],[40,11,40,16],[44,0,44,10],[41,0,41,10],[43,0,43,10],[43,11,43,16],[41,11,41,16],[39,0,39,10],[39,11,39,16],[40,0,40,10],[9,6,9,14],[2,1,2,16],[3,1,3,16],[4,1,4,16],[5,1,5,9],[6,1,6,8],[5,10,5,14],[6,10,6,14],[29,1,29,5],[29,6,29,8],[29,9,30,9],[11,9,12,9],[20,10,20,12],[29,10,29,12],[20,1,27,5],[20,6,20,8],[20,9,21,9],[11,1,11,2],[11,3,11,4],[30,1,30,2],[29,13,29,14],[29,15,29,16],[38,11,38,16],[9,0,9,5],[8,6,8,14],[28,0,28,17],[11,15,11,16],[19,0,19,17],[11,10,11,12],[11,13,11,14],[11,0,12,0],[11,6,11,8],[20,13,20,14],[20,15,20,16],[20,0,21,0],[29,0,30,0],[36,1,36,2],[30,3,30,4],[31,3,31,4],[32,3,32,4],[33,3,33,4],[34,3,34,4],[35,3,35,4],[36,3,36,4],[31,1,31,2],[32,1,32,2],[33,1,33,2],[34,1,34,2],[35,1,35,2]]}
[]
[]
[null,"Secretaría de Educación Pública del Estado de Baja California Sur"]
[null,"Dirección de Educación Secundaria"]
[null,"NORMALIDAD MÍNIMA"]
[null,"PERIODO DE EVALUACIÓN:",null,null,null,null,null,null,null,null,{"$f":"IF('APROV 1'!O7<>0,'APROV 1'!O7, \"\")","v":"CONCENTRADO TERCER PERIODO DE EVALUACIÓN"}]
[null,"CICLO ESCOLAR :",null,null,null,null,null,null,null,null,{"$f":"IF('APROV 1'!O8<>0, 'APROV 1'!O8, \"\")","v":"2022-2023"}]
[]
[null,null,null,null,null,null,{"$f":"MATRICULA!I11","v":"MTRA. OFELIA ELIZABETH OCHOA ROMERO"}]
[null,null,null,null,null,null,{"$f":"MATRICULA!I12","v":"DIRECCIÓN DE EDUCACIÓN SECUNDARIA"}]
[]
["MODALIDAD","DIRECTIVOS\nDirectores",null,"DIRECTIVOS\nSubdirectores",null,null,"COORDINADORES",null,null,"R","INASISTENCIAS",null,null,"LICENCIAS ECONÓMICAS",null,"LICENCIAS MÉDICAS",null,"TOTAL DE DÍAS NO LABORADOS"]
[null,"H","M","H","M","T","H","M","T",null,"I ","P.D.","D.N.L.I y P.D.","L.E."," D.N.L.E.","L.M.","D.N.L.M.","DNLI y PD, DNLE, DNLM"]
[{"$f":"IF(MATRICULA!B18=0,\"\",MATRICULA!B18)","v":"GENERALES PÚBLICAS"},34,10,18,20,{"$f":"IF(SUM(B14:E14)=0,\"\",SUM(B14:E14))","v":82},19,16,{"$f":"IF(SUM(G14,H14)=0,\"\",SUM(G14,H14))","v":35},4,null,25,{"$f":"IF(SUM(K14,L14)=0,\"\",SUM(K14,L14))","v":25},56,114,21,167,{"$f":"IF(SUM(M14,O14,Q14)=0,\"\",SUM(M14,O14,Q14))","v":306}]
[{"$f":"IF(MATRICULA!B19=0,\"\",MATRICULA!B19)","v":"GENERALES PARTICULARES"},null,null,null,null,{"$f":"IF(SUM(B15:E15)=0,\"\",SUM(B15:E15))","v":""},null,null,{"$f":"IF(SUM(G15,H15)=0,\"\",SUM(G15,H15))","v":""},null,null,null,{"$f":"IF(SUM(K15,L15)=0,\"\",SUM(K15,L15))","v":""},null,null,null,null,""]
[{"$f":"IF(MATRICULA!B20=0,\"\",MATRICULA!B20)","v":"SEC TÉCNICAS"},19,13,19,11,62,29,19,48,4,2,10,12,42,96,23,103,211]
[{"$f":"IF(MATRICULA!B21=0,\"\",MATRICULA!B21)","v":"TELESECUNDARIAS"},17,6,10,3,36,null,null,"",null,null,82,82,17,46,3,7,135]
[{"$f":"IF(MATRICULA!B22=0,\"\",MATRICULA!B22)","v":""},null,null,null,null,"",null,null,"",null,null,null,"",null,null,null,null,""]
["Total",{"$f":"IF(SUM(B14:B18)=0,\"\",SUM(B14:B18))","v":70},29,47,34,180,48,35,83,8,2,117,119,115,256,47,277,652]
[]
["MODALIDAD","PERSONAL  POR HORAS ",null,null,null,null,"DOCENTES",null,null,"R","INASISTENCIAS (Horas)",null,null,"LICENCIAS ECONÓMICAS",null,"LICENCIAS MÉDICAS",null,"TOTAL DE HORAS NO LABORADOS"]
[null,null,null,null,null,null,"F","E","T",null,"I ","P.D.","H.N.L.I y P.D.","L.E."," H.N.L.E.","L.M.","H.N.L.M.","HNLI y PD, HNLE, HNLM"]
[{"$f":"IF(MATRICULA!B18=0,\"\",MATRICULA!B18)","v":"GENERALES PÚBLICAS"},null,null,null,null,null,994,87,{"$f":"IF(SUM(G23,H23)=0,\"\",SUM(G23,H23))","v":1081},1071,1943,744,{"$f":"IF(SUM(K23,L23)=0,\"\",SUM(K23,L23))","v":2687},622,6073,365,4458,{"$f":"IF(SUM(M23,O23,Q23)=0,\"\",SUM(M23,O23,Q23))","v":13218}]
[{"$f":"IF(MATRICULA!B19=0,\"\",MATRICULA!B19)","v":"GENERALES PARTICULARES"},null,null,null,null,null,null,null,"",null,null,null,{"$f":"IF(SUM(K24,L24)=0,\"\",SUM(K24,L24))","v":""},null,null,null,null,""]
[{"$f":"IF(MATRICULA!B20=0,\"\",MATRICULA!B20)","v":"SEC TÉCNICAS"},null,null,null,null,null,725,123,848,362,1016,856,1872,515,5192,238,4083,11147]
[{"$f":"IF(MATRICULA!B21=0,\"\",MATRICULA!B21)","v":"TELESECUNDARIAS"},null,null,null,null,null,240,38,278,null,5,null,5,125,1136,26,323,1464]
[{"$f":"IF(MATRICULA!B22=0,\"\",MATRICULA!B22)","v":""},null,null,null,null,null,null,null,"",null,null,null,"",null,null,null,null,""]
["Total",null,null,null,null,null,{"$f":"IF(SUM(G23:G27)=0,\"\",SUM(G23:G27))","v":1959},248,2207,1433,2964,1600,4564,1262,12401,629,8864,25829]
[]
["MODALIDAD","ASISTENCIA EDUCATIVA\n(Psicólogos, trabajo social, médicos, prefectos)",null,null,null,null,"ADMINISTRATIVO Y DE APOYO",null,null,"R","INASISTENCIAS",null,null,"LICENCIAS ECONÓMICAS",null,"LICENCIAS MÉDICAS",null,"TOTAL DE DÍAS NO LABORADOS"]
[null,"F",null,"E",null,"T","F","E","T",null,"I ","P.D.","D.N.L.I y P.D.","L.E."," D.N.L.E.","L.M.","D.N.L.M.","DNLI y PD, DNLE, DNLM"]
[{"$f":"IF(MATRICULA!B18=0,\"\",MATRICULA!B18)","v":"GENERALES PÚBLICAS"},164,null,37,null,{"$f":"IF(SUM(B32:E32)=0,\"\",SUM(B32:E32))","v":201},294,155,{"$f":"IF(SUM(G32,H32)=0,\"\",SUM(G32,H32))","v":449},353,154,78,{"$f":"IF(SUM(K32,L32)=0,\"\",SUM(K32,L32))","v":232},449,932,158,742,{"$f":"IF(SUM(M32,O32,Q32)=0,\"\",SUM(M32,O32,Q32))","v":1906}]
[{"$f":"IF(MATRICULA!B19=0,\"\",MATRICULA!B19)","v":"GENERALES PARTICULARES"},null,null,null,null,{"$f":"IF(SUM(B33:E33)=0,\"\",SUM(B33:E33))","v":""},null,null,"",null,null,null,"",null,null,null,null,""]
[{"$f":"IF(MATRICULA!B20=0,\"\",MATRICULA!B20)","v":"SEC TÉCNICAS"},125,null,37,null,162,205,107,312,63,222,78,300,249,598,85,529,1427]
[{"$f":"IF(MATRICULA!B21=0,\"\",MATRICULA!B21)","v":"TELESECUNDARIAS"},14,null,16,null,30,37,65,102,null,null,null,"",48,230,26,375,605]
[{"$f":"IF(MATRICULA!B22=0,\"\",MATRICULA!B22)","v":""},null,null,null,null,"",null,null,"",null,null,null,"",null,null,null,null,""]
["Total",{"$f":"IF(SUM(B32:B36)=0,\"\",SUM(B32:B36))","v":303},null,{"$f":"IF(SUM(D32:D36)=0,\"\",SUM(D32:D36))","v":90},null,{"$f":"IF(SUM(F32:F36)=0,\"\",SUM(F32:F36))","v":393},536,327,863,416,376,156,532,746,1760,269,1646,3938]
[]
["NOTA:",null,null,null,null,null,null,null,null,null,null,"NOTA:"]
["I.: INASISTENCIAS",null,null,null,null,null,null,null,null,null,null,"H.N.L.E.: HORAS NO LABORADOS POR LICENCIAS ECONÓMICAS"]
["H.N.L.I.: HORAS NO LABORADAS POR INASISTENCIAS",null,null,null,null,null,null,null,null,null,null,"D.N.L.E.:  DÍAS NO LABORADOS POR LICENCIAS ECONÓMICAS"]
["D.N.L.I.: DÍAS NO LABORADOS POR INASISTENCIAS",null,null,null,null,null,null,null,null,null,null,"L.M.: PERSONAS QUE PRESENTARON LICENCIAS MÉDICAS"]
["R. :  CANTIDAD DE RETARDOS",null,null,null,null,null,null,null,null,null,null,"H.N.L.M.: HORAS NO LABORADAS POR LICENCIAS MÉDICAS"]
["L.E.:   PERSONAL QUE SOLICITÓ LICENCIAS ECONÓMICAS",null,null,null,null,null,null,null,null,null,null,"D.N.L.M.: DÍAS NO LABORADOS POR LICENCIAS MÉDICAS"]
["P.D.: PERMISOS DIRECCIÓN",null,null,null,null,null,null,null,null,null,null,"F: FONE     E: EVENTUALES"]