{"text_format":"1","workbook":"xlsx","n_sheets":10,"sheets":["MATRICULA","APROV 1","Gráfica APROV 1","APROV 2","Gráfica APROV 2","APROV 3","Gráfica APROV 3","Gráfica Promedios Finales","NORMALIDAD MÍNIMA","Hoja1"],"not_rendered":{"charts":4,"images":1,"macros":1,"external_links":0,"defined_names":8,"comments":0,"pivot_tables":0},"unopened":[],"bounds":{"document_bytes":16777216,"sheet_cells":100000,"rows_first":2000,"rows_last":500,"rows_between":2000,"halvings":0,"cell_chars":16384,"cell_head_chars":4096},"cells_cut":0,"cells_raw":0,"read":"whole","date_system":"1900"}

{"sheet":"MATRICULA","index":0,"n_rows":44,"n_cols":38,"rows_kept":44,"cut":false,"hidden":false,"merged":[[10,8,10,26],[10,1,10,7],[15,14,15,16],[11,8,11,26],[11,27,11,31],[1,2,1,30],[2,2,2,30],[4,2,4,30],[7,2,7,13],[7,14,7,26],[6,2,6,13],[6,14,6,26],[30,14,30,25],[15,17,15,19],[15,20,15,22],[31,35,31,37],[31,8,31,10],[31,11,31,13],[31,14,31,16],[31,17,31,19],[31,20,31,22],[31,23,31,25],[31,26,31,28],[31,29,31,31],[31,32,31,34],[15,23,15,25],[11,32,11,33],[11,1,12,7],[29,1,32,1],[29,2,29,25],[13,1,16,1],[13,2,13,25],[31,2,31,4],[31,5,31,7],[14,2,14,13],[14,14,14,25],[15,2,15,4],[15,5,15,7],[15,8,15,10],[15,11,15,13],[29,26,30,37],[30,2,30,13]]}
[]
[null,null,"Secretaría de Educación Pública del Estado de Baja California Sur"]
[null,null,"Dirección de Educación Secundaria"]
[]
[null,null,"MATRÍCULA"]
[]
[null,null,"PERIODO DE EVALUACIÓN:",null,null,null,null,null,null,null,null,null,null,null,"SEGUNDO PERIODO DE EVALUACIÓN"]
[null,null,"CICLO ESCOLAR :",null,null,null,null,null,null,null,null,null,null,null,"2022-2023"]
[]
[]
[null,null,null,null,null,null,null,null,"MTRA OFELIA ELIZABETH OCHOA ROMERO"]
[null,null,null,null,null,null,null,null,"CONCENTRADO EDUCACIÓN SECUNDARIA"]
[]
[null,"DEPARTAMENTOS","MATRÍCULA"]
[null,null,"INSCRIPCIÓN INICIAL ",null,null,null,null,null,null,null,null,null,null,null,"CAMBIOS DESDE OTRAS ESCUELAS (ALTAS)"]
[null,null,"PRIMERO",null,null,"SEGUNDO",null,null,"TERCERO",null,null,"TOTAL",null,null,"PRIMERO",null,null,"SEGUNDO",null,null,"TERCERO",null,null,"TOTAL"]
[null,null,"H","M","T","H","M","T","H","M","T","H","M","T","H","M","T","H","M","T","H","M","T","H","M","T"]
[null,"Generales Públicas",2882,2812,{"$f":"IF(SUM(C18,D18)=0,\"\",SUM(C18,D18))","v":5694},2784,2691,{"$f":"IF(SUM(F18,G18)=0,\"\",SUM(F18,G18))","v":5475},2788,2881,{"$f":"IF(SUM(I18,J18)=0,\"\",SUM(I18,J18))","v":5669},{"$f":"IF(SUM(C18,F18,I18)=0,\"\",SUM(C18,F18,I18))","v":8454},{"$f":"IF(SUM(D18,G18,J18)=0,\"\",SUM(SUM(D18,G18,J18)))","v":8384},{"$f":"IF(SUM(L18,M18)=0,\"\",SUM(L18,M18))","v":16838},71,53,{"$f":"IF(SUM(O18,P18)=0,\"\",SUM(O18,P18))","v":124},62,82,{"$f":"IF(SUM(R18,S18)=0,\"\",SUM(R18,S18))","v":144},41,60,{"$f":"IF(SUM(U18,V18)=0,\"\",SUM(U18,V18))","v":101},{"$f":"IF(SUM(O18,R18,U18)=0,\"\",SUM(O18,R18,U18))","v":174},{"$f":"IF(SUM(P18,S18,V18)=0,\"\",SUM(SUM(P18,S18,V18)))","v":195},{"$f":"IF(SUM(X18,Y18)=0,\"\",SUM(X18,Y18))","v":369}]
[null,"Particulares",767,729,{"$f":"IF(SUM(C19,D19)=0,\"\",SUM(C19,D19))","v":1496},622,657,{"$f":"IF(SUM(F19,G19)=0,\"\",SUM(F19,G19))","v":1279},587,639,{"$f":"IF(SUM(I19,J19)=0,\"\",SUM(I19,J19))","v":1226},{"$f":"IF(SUM(C19,F19,I19)=0,\"\",SUM(C19,F19,I19))","v":1976},{"$f":"IF(SUM(D19,G19,J19)=0,\"\",SUM(SUM(D19,G19,J19)))","v":2025},{"$f":"IF(SUM(L19,M19)=0,\"\",SUM(L19,M19))","v":4001},29,27,{"$f":"IF(SUM(O19,P19)=0,\"\",SUM(O19,P19))","v":56},26,25,{"$f":"IF(SUM(R19,S19)=0,\"\",SUM(R19,S19))","v":51},19,12,{"$f":"IF(SUM(U19,V19)=0,\"\",SUM(U19,V19))","v":31},{"$f":"IF(SUM(O19,R19,U19)=0,\"\",SUM(O19,R19,U19))","v":74},{"$f":"IF(SUM(P19,S19,V19)=0,\"\",SUM(SUM(P19,S19,V19)))","v":64},{"$f":"IF(SUM(X19,Y19)=0,\"\",SUM(X19,Y19))","v":138}]
[null,"Técnicas",2568,2549,5117,2570,2542,5112,2537,2539,5076,7675,7630,15305,75,64,139,53,73,126,31,49,23,159,186,345]
[null,"Telesecundarias",941,776,1717,926,813,1739,847,755,1602,2714,2344,5058,34,23,57,33,38,71,14,25,39,81,86,167]
[null,null,null,null,{"$f":"IF(SUM(C22,D22)=0,\"\",SUM(C22,D22))","v":""},null,null,{"$f":"IF(SUM(F22,G22)=0,\"\",SUM(F22,G22))","v":""},null,null,{"$f":"IF(SUM(I22,J22)=0,\"\",SUM(I22,J22))","v":""},{"$f":"IF(SUM(C22,F22,I22)=0,\"\",SUM(C22,F22,I22))","v":""},{"$f":"IF(SUM(D22,G22,J22)=0,\"\",SUM(SUM(D22,G22,J22)))","v":""},{"$f":"IF(SUM(L22,M22)=0,\"\",SUM(L22,M22))","v":""},null,null,{"$f":"IF(SUM(O22,P22)=0,\"\",SUM(O22,P22))","v":""},null,null,{"$f":"IF(SUM(R22,S22)=0,\"\",SUM(R22,S22))","v":""},null,null,{"$f":"IF(SUM(U22,V22)=0,\"\",SUM(U22,V22))","v":""},{"$f":"IF(SUM(O22,R22,U22)=0,\"\",SUM(O22,R22,U22))","v":""},{"$f":"IF(SUM(P22,S22,V22)=0,\"\",SUM(SUM(P22,S22,V22)))","v":""},{"$f":"IF(SUM(X22,Y22)=0,\"\",SUM(X22,Y22))","v":""}]
[null,null,null,null,"",null,null,"",null,null,"","","","",null,null,"",null,null,"",null,null,"","","",""]
[null,null,null,null,"",null,null,"",null,null,"","","","",null,null,"",null,null,"",null,null,"","","",""]
[null,null,null,null,"",null,null,"",null,null,"","","","",null,null,"",null,null,"",null,null,"","","",""]
[null,null,null,null,"",null,null,"",null,null,"","","","",null,null,"",null,null,"",null,null,"","","",""]
[null,null,null,null,"",null,null,"",null,null,"","","","",null,null,"",null,null,"",null,null,"","","",""]
[null,"TOTAL",{"$f":"IF(SUM(C18:C27)=0,\"\",SUM(C18:C27))","v":7158},6866,14024,6902,6703,13605,6759,6814,13573,20819,20383,41202,209,167,376,174,218,392,105,146,194,488,531,1019]
[]
[null,"Zona escolar","BAJAS",null,null,null,null,null,null,null,null,null,null,null,null,null,null,null,null,null,null,null,null,null,null,null,"EXISTENCIA"]
[null,null,"DESERCIÓN",null,null,null,null,null,null,null,null,null,null,null,"CAMBIOS HACIA OTRAS ESCUELAS (TRASLADOS)"]
[null,null,"PRIMERO",null,null,"SEGUNDO",null,null,"TERCERO",null,null,"TOTAL",null,null,"PRIMERO",null,null,"SEGUNDO",null,null,"TERCERO",null,null,"TOTAL",null,null,"PRIMERO",null,null,"SEGUNDO",null,null,"TERCERO",null,null,"TOTAL"]
[null,null,"H","M","T","H","M","T","H","M","T","H","M","T","H","M","T","H","M","T","H","M","T","H","M","T","H","M","T","H","M","T","H","M","T","H","M","T"]
[null,{"$f":"IF(B18=0,\"\",B18)","v":"Generales Públicas"},1,2,{"$f":"IF(SUM(C34,D34)=0,\"\",SUM(C34,D34))","v":3},3,4,{"$f":"IF(SUM(F34,G34)=0,\"\",SUM(F34,G34))","v":7},6,1,{"$f":"IF(SUM(I34,J34)=0,\"\",SUM(I34,J34))","v":7},{"$f":"IF(SUM(C34,F34,I34)=0,\"\",SUM(C34,F34,I34))","v":10},{"$f":"IF(SUM(D34,G34,J34)=0,\"\",SUM(SUM(D34,G34,J34)))","v":7},{"$f":"IF(SUM(L34,M34)=0,\"\",SUM(L34,M34))","v":17},87,75,{"$f":"IF(SUM(O34,P34)=0,\"\",SUM(O34,P34))","v":162},70,81,{"$f":"IF(SUM(R34,S34)=0,\"\",SUM(R34,S34))","v":151},64,60,{"$f":"IF(SUM(U34,V34)=0,\"\",SUM(U34,V34))","v":124},{"$f":"IF(SUM(O34,R34,U34)=0,\"\",SUM(O34,R34,U34))","v":221},{"$f":"IF(SUM(P34,S34,V34)=0,\"\",SUM(SUM(P34,S34,V34)))","v":216},{"$f":"IF(SUM(X34,Y34)=0,\"\",SUM(X34,Y34))","v":437},{"$f":"IF(SUM(C18,O18-C34-O34)=0,\"\",SUM(C18,O18-C34-O34))","v":2865},{"$f":"IF(SUM(D18,P18-D34-P34)=0,\"\",SUM(D18,P18-D34-P34))","v":2788},{"$f":"IF(SUM(AA34,AB34)=0,\"\",SUM(AA34,AB34))","v":5653},{"$f":"IF(SUM(F18,R18-F34-R34)=0,\"\",SUM(F18,R18-F34-R34))","v":2773},{"$f":"IF(SUM(G18,S18-G34-S34)=0,\"\",SUM(G18,S18-G34-S34))","v":2688},{"$f":"IF(SUM(AD34,AE34)=0,\"\",SUM(AD34,AE34))","v":5461},{"$f":"IF(SUM(I18,U18-I34-U34)=0,\"\",SUM(I18,U18-I34-U34))","v":2759},{"$f":"IF(SUM(J18,V18-J34-V34)=0,\"\",SUM(J18,V18-J34-V34))","v":2880},{"$f":"IF(SUM(AG34,AH34)=0,\"\",SUM(AG34,AH34))","v":5639},{"$f":"IF(SUM(AA34,AD34,AG34)=0,\"\",SUM(AA34,AD34,AG34))","v":8397},{"$f":"IF(SUM(AB34,AE34,AH34)=0,\"\",SUM(SUM(AB34,AE34,AH34)))","v":8356},{"$f":"IF(SUM(AJ34,AK34)=0,\"\",SUM(AJ34,AK34))","v":16753}]
[null,{"$f":"IF(B19=0,\"\",B19)","v":"Particulares"},1,2,{"$f":"IF(SUM(C35,D35)=0,\"\",SUM(C35,D35))","v":3},0,1,{"$f":"IF(SUM(F35,G35)=0,\"\",SUM(F35,G35))","v":1},1,1,{"$f":"IF(SUM(I35,J35)=0,\"\",SUM(I35,J35))","v":2},{"$f":"IF(SUM(C35,F35,I35)=0,\"\",SUM(C35,F35,I35))","v":2},{"$f":"IF(SUM(D35,G35,J35)=0,\"\",SUM(SUM(D35,G35,J35)))","v":4},{"$f":"IF(SUM(L35,M35)=0,\"\",SUM(L35,M35))","v":6},14,10,{"$f":"IF(SUM(O35,P35)=0,\"\",SUM(O35,P35))","v":24},10,16,{"$f":"IF(SUM(R35,S35)=0,\"\",SUM(R35,S35))","v":26},6,13,{"$f":"IF(SUM(U35,V35)=0,\"\",SUM(U35,V35))","v":19},{"$f":"IF(SUM(O35,R35,U35)=0,\"\",SUM(O35,R35,U35))","v":30},{"$f":"IF(SUM(P35,S35,V35)=0,\"\",SUM(SUM(P35,S35,V35)))","v":39},{"$f":"IF(SUM(X35,Y35)=0,\"\",SUM(X35,Y35))","v":69},781,744,1525,638,665,{"$f":"IF(SUM(AD35,AE35)=0,\"\",SUM(AD35,AE35))","v":1303},599,637,{"$f":"IF(SUM(AG35,AH35)=0,\"\",SUM(AG35,AH35))","v":1236},{"$f":"IF(SUM(AA35,AD35,AG35)=0,\"\",SUM(AA35,AD35,AG35))","v":2018},{"$f":"IF(SUM(AB35,AE35,AH35)=0,\"\",SUM(SUM(AB35,AE35,AH35)))","v":2046},{"$f":"IF(SUM(AJ35,AK35)=0,\"\",SUM(AJ35,AK35))","v":4064}]
[null,"Técnicas",12,8,20,12,9,21,10,3,13,34,20,54,64,70,134,58,84,142,42,51,93,164,205,369,2567,2535,5102,2553,2522,5075,2516,2534,5050,7636,7591,15227]
[null,"Telesecundarias",8,3,11,4,5,9,5,4,9,17,12,29,28,19,47,16,23,39,24,19,43,68,61,129,939,777,1716,939,823,1762,832,757,1589,2710,2357,5067]
[null,"",null,null,{"$f":"IF(SUM(C38,D38)=0,\"\",SUM(C38,D38))","v":""},null,null,{"$f":"IF(SUM(F38,G38)=0,\"\",SUM(F38,G38))","v":""},null,null,{"$f":"IF(SUM(I38,J38)=0,\"\",SUM(I38,J38))","v":""},{"$f":"IF(SUM(C38,F38,I38)=0,\"\",SUM(C38,F38,I38))","v":""},"",{"$f":"IF(SUM(L38,M38)=0,\"\",SUM(L38,M38))","v":""},null,null,{"$f":"IF(SUM(O38,P38)=0,\"\",SUM(O38,P38))","v":""},null,null,{"$f":"IF(SUM(R38,S38)=0,\"\",SUM(R38,S38))","v":""},null,null,{"$f":"IF(SUM(U38,V38)=0,\"\",SUM(U38,V38))","v":""},{"$f":"IF(SUM(O38,R38,U38)=0,\"\",SUM(O38,R38,U38))","v":""},{"$f":"IF(SUM(P38,S38,V38)=0,\"\",SUM(SUM(P38,S38,V38)))","v":""},{"$f":"IF(SUM(X38,Y38)=0,\"\",SUM(X38,Y38))","v":""},"","",{"$f":"IF(SUM(AA38,AB38)=0,\"\",SUM(AA38,AB38))","v":""},"","",{"$f":"IF(SUM(AD38,AE38)=0,\"\",SUM(AD38,AE38))","v":""},"","",{"$f":"IF(SUM(AG38,AH38)=0,\"\",SUM(AG38,AH38))","v":""},{"$f":"IF(SUM(AA38,AD38,AG38)=0,\"\",SUM(AA38,AD38,AG38))","v":""},{"$f":"IF(SUM(AB38,AE38,AH38)=0,\"\",SUM(SUM(AB38,AE38,AH38)))","v":""},{"$f":"IF(SUM(AJ38,AK38)=0,\"\",SUM(AJ38,AK38))","v":""}]
[null,"",null,null,"",null,null,"",null,null,"","","","",null,null,"",null,null,"",null,null,"","","","","","","","","","","","","","","",""]
[null,"",null,null,"",null,null,"",null,null,"","","","",null,null,"",null,null,"",null,null,"","","","","","","","","","","","","","","",""]
[null,"",null,null,"",null,null,"",null,null,"","","","",null,null,"",null,null,"",null,null,"","","","","","","","","","","","","","","",""]
[null,"",null,null,"",null,null,"",null,null,"","","","",null,null,"",null,null,"",null,null,"","","","","","","","","","","","","","","",""]
[null,"",null,null,"",null,null,"",null,null,"","","","",null,null,"",null,null,"",null,null,"","","","","","","","","","","","","","","",""]
[null,"TOTAL",{"$f":"IF(SUM(C34:C43)=0,\"\",SUM(C34:C43))","v":22},15,37,19,19,38,22,9,31,63,43,106,193,174,367,154,204,358,136,143,279,483,521,1004,7152,6844,13996,6903,6698,13601,6706,6808,13514,20761,20350,41111]

{"sheet":"APROV 1","index":1,"n_rows":43,"n_cols":34,"rows_kept":43,"cut":false,"hidden":false,"merged":[[12,32,13,33],[27,32,28,33],[28,0,29,1],[30,0,30,1],[31,0,31,1],[32,0,32,1],[33,0,33,1],[34,0,34,1],[35,0,35,1],[20,2,20,4],[20,5,20,7],[20,8,20,10],[20,11,20,13],[20,14,20,16],[20,17,20,19],[20,20,20,22],[20,23,20,25],[20,26,20,28],[17,2,17,4],[15,32,15,33],[16,29,16,31],[16,32,16,33],[19,2,19,4],[19,5,19,7],[20,29,20,31],[21,2,21,4],[21,5,21,7],[21,8,21,10],[21,11,21,13],[21,14,21,16],[21,17,21,19],[21,20,21,22],[21,23,21,25],[21,26,21,28],[18,14,18,16],[18,17,18,19],[18,20,18,22],[18,23,18,25],[18,26,18,28],[19,8,19,10],[19,11,19,13],[19,14,19,16],[19,17,19,19],[19,20,19,22],[19,23,19,25],[19,26,19,28],[18,11,18,13],[16,20,16,22],[16,23,16,25],[16,26,16,28],[15,26,15,28],[15,17,15,19],[15,20,15,22],[15,23,15,25],[17,14,17,16],[17,17,17,19],[17,20,17,22],[17,23,17,25],[17,26,17,28],[15,2,15,4],[15,5,15,7],[15,8,15,10],[15,11,15,13],[46,0,73,33],[22,29,22,31],[23,29,23,31],[22,20,22,22],[23,20,23,22],[23,2,23,4],[18,29,18,31],[22,5,22,7],[23,5,23,7],[28,29,28,31],[28,11,28,13],[28,14,28,16],[28,20,28,22],[28,26,28,28],[22,23,22,25],[23,23,23,25],[15,29,15,31],[17,5,17,7],[16,2,16,4],[24,2,24,4],[24,14,24,16],[22,8,22,10],[25,32,25,33],[19,32,19,33],[0,0,0,33],[2,2,2,30],[3,2,3,30],[4,2,4,30],[5,2,5,30],[10,0,10,3],[22,11,22,13],[23,11,23,13],[24,11,24,13],[22,26,22,28],[23,32,23,33],[24,32,24,33],[24,29,24,31],[17,29,17,31],[17,32,17,33],[24,26,24,28],[18,2,18,4],[18,5,18,7],[18,8,18,10],[23,26,23,28],[24,5,24,7],[22,32,22,33],[22,2,22,4],[18,32,18,33],[16,8,16,10],[16,11,16,13],[9,0,9,3],[23,8,23,10],[24,8,24,10],[22,14,22,16],[23,14,23,16],[24,23,24,25],[22,17,22,19],[23,17,23,19],[24,17,24,19],[24,20,24,22],[19,29,19,31],[20,32,20,33],[21,29,21,31],[21,32,21,33],[14,32,14,33],[13,0,14,0],[13,2,13,4],[17,8,17,10],[17,11,17,13],[15,14,15,16],[10,5,10,18],[9,5,9,18],[13,5,13,7],[13,8,13,10],[13,11,13,13],[13,14,13,16],[13,17,13,19],[14,17,14,19],[14,14,14,16],[16,5,16,7],[16,14,16,16],[16,17,16,19],[6,2,6,13],[7,2,7,13],[6,14,6,26],[7,14,7,26],[14,5,14,7],[12,26,12,31],[14,23,14,25],[14,20,14,22],[10,24,10,25],[10,27,10,31],[12,0,12,25],[14,8,14,10],[13,20,13,22],[14,2,14,4],[14,11,14,13],[13,29,13,31],[14,29,14,31],[13,26,13,28],[14,26,14,28],[13,23,13,25],[42,0,44,33],[28,2,28,4],[28,5,28,7],[28,8,28,10],[28,17,28,19],[28,23,28,25],[25,2,25,4],[25,8,25,10],[25,5,25,7],[27,26,27,31],[27,0,27,25],[25,29,25,31],[25,11,25,13],[25,14,25,16],[25,17,25,19],[25,20,25,22],[25,26,25,28],[25,23,25,25],[40,0,40,1],[36,0,36,1],[37,0,37,1],[38,0,38,1],[39,0,39,1]]}
[]
[]
[null,null,"Secretaría de Educación Pública del Estado de Baja California Sur"]
[null,null,"Dirección de Educación Secundaria"]
[null,null,"APROVECHAMIENTO Y RIESGO DE NO ACREDITAR"]
[null,null,"PRIMER GRADO "]
[null,null,"PERIODO EVALUACIÓN:",null,null,null,null,null,null,null,null,null,null,null,{"$f":"IF(MATRICULA!O7=0,\"\",MATRICULA!O7)","v":"SEGUNDO PERIODO DE EVALUACIÓN"}]
[null,null,"CICLO ESCOLAR :",null,null,null,null,null,null,null,null,null,null,null,{"$f":"IF(MATRICULA!O8=0,\"\",MATRICULA!O8)","v":"2022-2023"}]
[]
["JEFE DEPARTAMENTO :",null,null,null,null,{"$f":"MATRICULA!I11","v":"MTRA OFELIA ELIZABETH OCHOA ROMERO"}]
["MODALIDAD :",null,null,null,null,{"$f":"MATRICULA!I12","v":"CONCENTRADO EDUCACIÓN SECUNDARIA"}]
[]
["Promedio de Aprovechamiento de los Campos de Formación Académica",null,null,null,null,null,null,null,null,null,null,null,null,null,null,null,null,null,null,null,null,null,null,null,null,null,"Promedio de Aprovechamiento de las Áreas de Desarrollo Personal y Social",null,null,null,null,null,"Prom. Final"]
["DE","GRUPOS","Lengua Materna ",null,null,"Matemáticas",null,null,"Inglés",null,null,"Ciencias y tecnología (Biología)",null,null,"Historia",null,null,"Geografía",null,null,"Formación Cívica y Ética",null,null,"Tecnología I",null,null,"Educación Física",null,null,"Artes"]
[null,null,"CALIF",null,null,"CALIF",null,null,"CALIF",null,null,"CALIF",null,null,"CALIF",null,null,"CALIF",null,null,"CALIF",null,null,"CALIF",null,null,"CALIF",null,null,"CALIF",null,null,"CALIF"]
[{"$f":"IF(MATRICULA!B18=0,\"\",MATRICULA!B18)","v":"Generales Públicas"},186,8.5,null,null,8.1999999999999993,null,null,8.6,null,null,8.5,null,null,8.6,null,null,8.6,null,null,8.5,null,null,8.8000000000000007,null,null,9.4,null,null,8.9,null,null,{"$f":"IFERROR(ROUND(AVERAGE(C16:AF16),1),\"\")","v":8.6999999999999993}]
[{"$f":"IF(MATRICULA!B19=0,\"\",MATRICULA!B19)","v":"Particulares"},77,8.3000000000000007,null,null,8.4,null,null,8.6999999999999993,null,null,8.6,null,null,8.6,null,null,8.6999999999999993,null,null,8.9,null,null,9,null,null,9.5,null,null,9.4,null,null,{"$f":"IFERROR(ROUND(AVERAGE(C17:AF17),1),\"\")","v":8.8000000000000007}]
[{"$f":"IF(MATRICULA!B20=0,\"\",MATRICULA!B20)","v":"Técnicas"},244,8.3000000000000007,null,null,8.1,null,null,8.4,null,null,8.4,null,null,8.1999999999999993,null,null,8.4,null,null,8.3000000000000007,null,null,8.6,null,null,9.4,null,null,8.6999999999999993,null,null,8.5]
[{"$f":"IF(MATRICULA!B21=0,\"\",MATRICULA!B21)","v":"Telesecundarias"},102,8.1,null,null,7.9,null,null,8.1999999999999993,null,null,8.1999999999999993,null,null,8.1,null,null,8.1,null,null,8.4,null,null,8.9,null,null,9.1999999999999993,null,null,8.9,null,null,8.4]
[{"$f":"IF(MATRICULA!B22=0,\"\",MATRICULA!B22)","v":""},null,null,null,null,null,null,null,null,null,null,null,null,null,null,null,null,null,null,null,null,null,null,null,null,null,null,null,null,null,null,null,""]
[{"$f":"IF(MATRICULA!B23=0,\"\",MATRICULA!B23)","v":""},null,null,null,null,null,null,null,null,null,null,null,null,null,null,null,null,null,null,null,null,null,null,null,null,null,null,null,null,null,null,null,""]
[{"$f":"IF(MATRICULA!B24=0,\"\",MATRICULA!B24)","v":""},null,null,null,null,null,null,null,null,null,null,null,null,null,null,null,null,null,null,null,null,null,null,null,null,null,null,null,null,null,null,null,""]
[{"$f":"IF(MATRICULA!B25=0,\"\",MATRICULA!B25)","v":""},null,null,null,null,null,null,null,null,null,null,null,null,null,null,null,null,null,null,null,null,null,null,null,null,null,null,null,null,null,null,null,""]
[{"$f":"IF(MATRICULA!B26=0,\"\",MATRICULA!B26)","v":""},null,null,null,null,null,null,null,null,null,null,null,null,null,null,null,null,null,null,null,null,null,null,null,null,null,null,null,null,null,null,null,""]
[{"$f":"IF(MATRICULA!B27=0,\"\",MATRICULA!B27)","v":""},null,null,null,null,null,null,null,null,null,null,null,null,null,null,null,null,null,null,null,null,null,null,null,null,null,null,null,null,null,null,null,""]
["Gral.",{"$f":"IF(SUM(B16:B24)=0,\"\",SUM(B16:B24))","v":609},{"$f":"IFERROR(ROUND(AVERAGE(C16:E25),1),\"\")","v":8.3000000000000007},null,null,{"$f":"IFERROR(ROUND(AVERAGE(F16:H25),1),\"\")","v":8.1999999999999993},null,null,{"$f":"IFERROR(ROUND(AVERAGE(I16:K25),1),\"\")","v":8.5},null,null,{"$f":"IFERROR(ROUND(AVERAGE(L16:N25),1),\"\")","v":8.4},null,null,{"$f":"IFERROR(ROUND(AVERAGE(O16:Q25),1),\"\")","v":8.4},null,null,{"$f":"IFERROR(ROUND(AVERAGE(R16:T25),1),\"\")","v":8.5},null,null,{"$f":"IFERROR(ROUND(AVERAGE(U16:W25),1),\"\")","v":8.5},null,null,{"$f":"IFERROR(ROUND(AVERAGE(X16:Z25),1),\"\")","v":8.8000000000000007},null,null,{"$f":"IFERROR(ROUND(AVERAGE(AA16:AC25),1),\"\")","v":9.4},null,null,{"$f":"IFERROR(ROUND(AVERAGE(AD16:AF25),1),\"\")","v":9},null,null,{"$f":"IFERROR(ROUND(AVERAGE(C26:AF26),1),\"\")","v":8.6}]
[]
["Campos de Formación Académica en riesgo de no acreditar",null,null,null,null,null,null,null,null,null,null,null,null,null,null,null,null,null,null,null,null,null,null,null,null,null,"Áreas de Desarrollo Personal y Social en situación de riesgo de no acreditar",null,null,null,null,null,"Total"]
["ZONA ESCOLAR",null,"Lengua Materna",null,null,"Matemáticas",null,null,"Inglés",null,null,"Ciencias y tecnología (Biología)",null,null,"Historia",null,null,"Geografía",null,null,"Formación Cívica y Ética",null,null,"Tecnología I",null,null,"Educación Física",null,null,"Artes"]
[null,null,5,6,"T",5,6,"T",5,6,"T",5,6,"T",5,6,"T",5,6,"T",5,6,"T",5,6,"T",5,6,"T",5,6,"T",5,6]
[{"$f":"IF(MATRICULA!B18=0,\"\",MATRICULA!B18)","v":"Generales Públicas"},null,181,461,{"$f":"IF(SUM(C31,D31)=0,\"\",SUM(C31,D31))","v":642},242,590,{"$f":"IF(SUM(F31,G31)=0,\"\",SUM(F31,G31))","v":832},136,354,{"$f":"IF(SUM(I31,J31)=0,\"\",SUM(I31,J31))","v":490},263,371,{"$f":"IF(SUM(L31,M31)=0,\"\",SUM(L31,M31))","v":634},164,357,{"$f":"IF(SUM(O31,P31)=0,\"\",SUM(O31,P31))","v":521},230,415,{"$f":"IF(SUM(R31,S31)=0,\"\",SUM(R31,S31))","v":645},164,390,{"$f":"IF(SUM(U31,V31)=0,\"\",SUM(U31,V31))","v":554},178,313,{"$f":"IF(SUM(X31,Y31)=0,\"\",SUM(X31,Y31))","v":491},38,89,{"$f":"IF(SUM(AA31,AB31)=0,\"\",SUM(AA31,AB31))","v":127},75,247,{"$f":"IF(SUM(AD31,AE31)=0,\"\",SUM(AD31,AE31))","v":322},{"$f":"IF(SUM(C31,F31,I31,L31,O31,R31,U31,X31,AA31,AD31)=0,\"\",SUM(C31,F31,I31,L31,O31,R31,U31,X31,AA31,AD31))","v":1671},{"$f":"IF(SUM(D31,G31,J31,M31,P31,S31,V31,Y31,AB31,AE31)=0,\"\",SUM(D31,G31,J31,M31,P31,S31,V31,Y31,AB31,AE31))","v":3587}]
[{"$f":"IF(MATRICULA!B19=0,\"\",MATRICULA!B19)","v":"Particulares"},null,18,36,{"$f":"IF(SUM(C32,D32)=0,\"\",SUM(C32,D32))","v":54},16,34,{"$f":"IF(SUM(F32,G32)=0,\"\",SUM(F32,G32))","v":50},11,58,{"$f":"IF(SUM(I32,J32)=0,\"\",SUM(I32,J32))","v":69},11,81,{"$f":"IF(SUM(L32,M32)=0,\"\",SUM(L32,M32))","v":92},11,51,{"$f":"IF(SUM(O32,P32)=0,\"\",SUM(O32,P32))","v":62},7,67,{"$f":"IF(SUM(R32,S32)=0,\"\",SUM(R32,S32))","v":74},21,162,{"$f":"IF(SUM(U32,V32)=0,\"\",SUM(U32,V32))","v":183},22,63,{"$f":"IF(SUM(X32,Y32)=0,\"\",SUM(X32,Y32))","v":85},3,12,{"$f":"IF(SUM(AA32,AB32)=0,\"\",SUM(AA32,AB32))","v":15},13,21,{"$f":"IF(SUM(AD32,AE32)=0,\"\",SUM(AD32,AE32))","v":34},{"$f":"IF(SUM(C32,F32,I32,L32,O32,R32,U32,X32,AA32,AD32)=0,\"\",SUM(C32,F32,I32,L32,O32,R32,U32,X32,AA32,AD32))","v":133},{"$f":"IF(SUM(D32,G32,J32,M32,P32,S32,V32,Y32,AB32,AE32)=0,\"\",SUM(D32,G32,J32,M32,P32,S32,V32,Y32,AB32,AE32))","v":585}]
[{"$f":"IF(MATRICULA!B20=0,\"\",MATRICULA!B20)","v":"Técnicas"},null,289,454,{"$f":"IF(SUM(C33,D33)=0,\"\",SUM(C33,D33))","v":743},212,688,900,242,485,727,232,518,750,387,526,913,210,455,665,237,509,746,242,424,666,46,62,108,186,417,603,2283,{"$f":"IF(SUM(D33,G33,J33,M33,P33,S33,V33,Y33,AB33,AE33)=0,\"\",SUM(D33,G33,J33,M33,P33,S33,V33,Y33,AB33,AE33))","v":4538}]
[{"$f":"IF(MATRICULA!B21=0,\"\",MATRICULA!B21)","v":"Telesecundarias"},null,59,160,219,51,192,243,38,173,211,60,163,223,45,171,216,73,148,221,42,132,174,25,76,101,20,39,59,31,64,95,444,1318]
[{"$f":"IF(MATRICULA!B22=0,\"\",MATRICULA!B22)","v":""},null,null,null,"",null,null,""]
[{"$f":"IF(MATRICULA!B23=0,\"\",MATRICULA!B23)","v":""},null,null,null,"",null,null,"",null,null,"",null,null,"",null,null,"",null,null,"",null,null,"",null,null,"",null,null,"",null,null,"","",""]
[{"$f":"IF(MATRICULA!B24=0,\"\",MATRICULA!B24)","v":""},null,null,null,"",null,null,"",null,null,"",null,null,"",null,null,"",null,null,"",null,null,"",null,null,"",null,null,"",null,null,"","",""]
[{"$f":"IF(MATRICULA!B25=0,\"\",MATRICULA!B25)","v":""},null,null,null,{"$f":"IF(SUM(C38,D38)=0,\"\",SUM(C38,D38))","v":""},null,null,{"$f":"IF(SUM(F38,G38)=0,\"\",SUM(F38,G38))","v":""},null,null,{"$f":"IF(SUM(I38,J38)=0,\"\",SUM(I38,J38))","v":""},null,null,{"$f":"IF(SUM(L38,M38)=0,\"\",SUM(L38,M38))","v":""},null,null,{"$f":"IF(SUM(O38,P38)=0,\"\",SUM(O38,P38))","v":""},null,null,{"$f":"IF(SUM(R38,S38)=0,\"\",SUM(R38,S38))","v":""},null,null,{"$f":"IF(SUM(U38,V38)=0,\"\",SUM(U38,V38))","v":""},null,null,{"$f":"IF(SUM(X38,Y38)=0,\"\",SUM(X38,Y38))","v":""},null,null,{"$f":"IF(SUM(AA38,AB38)=0,\"\",SUM(AA38,AB38))","v":""},null,null,{"$f":"IF(SUM(AD38,AE38)=0,\"\",SUM(AD38,AE38))","v":""},{"$f":"IF(SUM(C38,F38,I38,L38,O38,R38,U38,X38,AA38,AD38)=0,\"\",SUM(C38,F38,I38,L38,O38,R38,U38,X38,AA38,AD38))","v":""},{"$f":"IF(SUM(D38,G38,J38,M38,P38,S38,V38,Y38,AB38,AE38)=0,\"\",SUM(D38,G38,J38,M38,P38,S38,V38,Y38,AB38,AE38))","v":""}]
[{"$f":"IF(MATRICULA!B26=0,\"\",MATRICULA!B26)","v":""},null,null,null,{"$f":"IF(SUM(C39,D39)=0,\"\",SUM(C39,D39))","v":""},null,null,{"$f":"IF(SUM(F39,G39)=0,\"\",SUM(F39,G39))","v":""},null,null,{"$f":"IF(SUM(I39,J39)=0,\"\",SUM(I39,J39))","v":""},null,null,{"$f":"IF(SUM(L39,M39)=0,\"\",SUM(L39,M39))","v":""},null,null,{"$f":"IF(SUM(O39,P39)=0,\"\",SUM(O39,P39))","v":""},null,null,{"$f":"IF(SUM(R39,S39)=0,\"\",SUM(R39,S39))","v":""},null,null,{"$f":"IF(SUM(U39,V39)=0,\"\",SUM(U39,V39))","v":""},null,null,{"$f":"IF(SUM(X39,Y39)=0,\"\",SUM(X39,Y39))","v":""},null,null,{"$f":"IF(SUM(AA39,AB39)=0,\"\",SUM(AA39,AB39))","v":""},null,null,{"$f":"IF(SUM(AD39,AE39)=0,\"\",SUM(AD39,AE39))","v":""},{"$f":"IF(SUM(C39,F39,I39,L39,O39,R39,U39,X39,AA39,AD39)=0,\"\",SUM(C39,F39,I39,L39,O39,R39,U39,X39,AA39,AD39))","v":""},{"$f":"IF(SUM(D39,G39,J39,M39,P39,S39,V39,Y39,AB39,AE39)=0,\"\",SUM(D39,G39,J39,M39,P39,S39,V39,Y39,AB39,AE39))","v":""}]
[{"$f":"IF(MATRICULA!B27=0,\"\",MATRICULA!B27)","v":""},null,null,null,"",null,null,"",null,null,"",null,null,"",null,null,"",null,null,"",null,null,"",null,null,"",null,null,"",null,null,"","",""]
["Total",null,{"$f":"IF(SUM(C31:C40)=0,\"\",SUM(C31:C40))","v":547},1111,1658,521,1504,2025,427,1070,1497,566,1133,1699,607,1105,1712,520,1085,1605,464,1193,1657,467,876,1343,107,202,309,305,749,1054,4531,10028]
[]
["Nota: Para las columnas \"Campos de Formación Académica y Áreas de Desarrollo Personal y Social en riesgo de no acreditar\" registre la cantidad de cincos o seis que existen en cada campo o área."]

{"sheet":"Gráfica APROV 1","index":2,"n_rows":18,"n_cols":14,"rows_kept":18,"cut":false,"hidden":false,"merged":[[6,1,6,12],[5,13,5,25],[6,13,6,25],[0,0,0,32],[2,1,2,29],[3,1,3,29],[4,1,4,29],[5,1,5,12],[8,7,8,20],[9,7,9,20],[9,0,9,6],[8,0,8,6],[33,0,47,32]]}
[]
[]
[null,"Secretaría de Educación Pública del Estado de Baja California Sur"]
[null,"Dirección de Educación Secundaria"]
[null,"PRIMER GRADO "]
[null,"PERIODO EVALUACIÓN:",null,null,null,null,null,null,null,null,null,null,null,{"$f":"MATRICULA!$O$7","v":"SEGUNDO PERIODO DE EVALUACIÓN"}]
[null,"CICLO ESCOLAR :",null,null,null,null,null,null,null,null,null,null,null,{"$f":"MATRICULA!$O$8","v":"2022-2023"}]
[]
["JEFE DEPARTAMENTO :",null,null,null,null,null,null,{"$f":"MATRICULA!I11","v":"MTRA OFELIA ELIZABETH OCHOA ROMERO"}]
["MODALIDAD :",null,null,null,null,null,null,{"$f":"MATRICULA!I12","v":"CONCENTRADO EDUCACIÓN SECUNDARIA"}]
[]
[]
[]
[]
[]
[]
[null,"Lengua Materna","Matemáticas","Inglés","Ciencias y tecnología (Biología)","Historia","Geografía","Formación Cívica y Ética","Tecnología I","Educación Física","Artes"]
[null,{"$f":"'APROV 1'!C26","v":8.3000000000000007},{"$f":"'APROV 1'!F26","v":8.1999999999999993},{"$f":"'APROV 1'!I26","v":8.5},{"$f":"'APROV 1'!L26","v":8.4},{"$f":"'APROV 1'!O26","v":8.4},{"$f":"'APROV 1'!R26","v":8.5},{"$f":"'APROV 1'!U26","v":8.5},{"$f":"'APROV 1'!X26","v":8.8000000000000007},{"$f":"'APROV 1'!AA26","v":9.4},{"$f":"'APROV 1'!AD26","v":9}]

{"sheet":"APROV 2","index":3,"n_rows":44,"n_cols":31,"rows_kept":44,"cut":false,"hidden":false,"merged":[[34,0,34,1],[35,0,35,1],[36,0,36,1],[37,0,37,1],[20,8,20,10],[29,20,29,22],[28,0,28,22],[14,23,14,25],[15,23,15,25],[15,2,15,4],[18,2,18,4],[20,2,20,4],[22,2,22,4],[23,2,23,4],[24,2,24,4],[25,2,25,4],[25,23,25,25],[21,17,21,19],[22,17,22,19],[20,17,20,19],[17,11,17,13],[17,14,17,16],[17,17,17,19],[17,20,17,22],[23,8,23,10],[24,8,24,10],[25,8,25,10],[23,14,23,16],[24,14,24,16],[25,14,25,16],[15,5,15,7],[23,5,23,7],[24,5,24,7],[25,5,25,7],[16,5,16,7],[18,5,18,7],[20,5,20,7],[22,5,22,7],[21,11,21,13],[21,14,21,16],[22,11,22,13],[22,14,22,16],[20,11,20,13],[20,14,20,16],[17,8,17,10],[2,2,2,27],[3,2,3,27],[4,2,4,27],[5,2,5,27],[6,14,6,24],[7,14,7,24],[6,2,6,13],[7,2,7,13],[9,0,9,7],[9,8,9,24],[29,26,29,28],[21,2,21,4],[21,5,21,7],[21,8,21,10],[22,8,22,10],[29,14,29,16],[26,20,26,22],[43,0,44,30],[26,14,26,16],[26,26,26,28],[26,17,26,19],[26,2,26,4],[29,29,29,30],[26,29,26,30],[26,5,26,7],[26,8,26,10],[29,2,29,4],[29,5,29,7],[29,8,29,10],[29,17,29,19],[29,23,29,25],[29,11,29,13],[38,0,38,1],[39,0,39,1],[40,0,40,1],[41,0,41,1],[31,0,31,1],[29,0,30,1],[32,0,32,1],[33,0,33,1],[15,29,15,30],[14,17,14,19],[26,23,26,25],[26,11,26,13],[23,29,23,30],[24,29,24,30],[25,29,25,30],[23,17,23,19],[24,17,24,19],[25,17,25,19],[23,20,23,22],[24,20,24,22],[25,20,25,22],[15,11,15,13],[23,11,23,13],[24,11,24,13],[25,11,25,13],[14,11,14,13],[19,29,19,30],[20,29,20,30],[21,29,21,30],[22,29,22,30],[23,23,23,25],[24,23,24,25],[20,20,20,22],[20,23,20,25],[20,26,20,28],[21,20,21,22],[21,23,21,25],[21,26,21,28],[22,20,22,22],[22,23,22,25],[22,26,22,28],[19,26,19,28],[13,29,13,30],[28,23,28,28],[28,29,28,30],[45,0,56,30],[15,8,15,10],[14,20,14,22],[15,14,15,16],[15,17,15,19],[15,20,15,22],[14,29,14,30],[14,0,15,0],[14,2,14,4],[14,5,14,7],[14,8,14,10],[14,26,14,28],[15,26,15,28],[23,26,23,28],[24,26,24,28],[25,26,25,28],[16,2,16,4],[16,8,16,10],[16,29,16,30],[17,2,17,4],[17,5,17,7],[17,29,17,30],[18,8,18,10],[18,11,18,13],[18,14,18,16],[18,17,18,19],[18,20,18,22],[18,23,18,25],[18,26,18,28],[18,29,18,30],[10,0,10,7],[10,8,10,24],[19,2,19,4],[19,5,19,7],[19,8,19,10],[19,11,19,13],[19,14,19,16],[19,17,19,19],[19,20,19,22],[19,23,19,25],[13,23,13,28],[16,11,16,13],[16,14,16,16],[16,17,16,19],[16,20,16,22],[16,23,16,25],[16,26,16,28],[13,0,13,22],[14,1,15,1],[17,23,17,25],[17,26,17,28],[11,5,11,11],[11,13,11,14],[14,14,14,16]]}
[]
[]
[null,null,"Secretaría de Educación Pública del Estado de Baja California Sur"]
[null,null,"Dirección de Educación Secundaria"]
[null,null,"APROVECHAMIENTO Y RIESGO DE NO ACREDITAR"]
[null,null,"SEGUNDO GRADO"]
[null,null,"PERIODO EVALUACIÓN:",null,null,null,null,null,null,null,null,null,null,null,{"$f":"IF('APROV 1'!O7:AA7<>0,'APROV 1'!O7:AA7, \"\")","v":"SEGUNDO PERIODO DE EVALUACIÓN"}]
[null,null,"CICLO ESCOLAR :",null,null,null,null,null,null,null,null,null,null,null,{"$f":"IF('APROV 1'!O8:AA8<>0, 'APROV 1'!O8:AA8, \"\")","v":"2022-2023"}]
[]
["JEFE DE DEPARTAMENTO: ",null,null,null,null,null,null,null,{"$f":"MATRICULA!I11","v":"MTRA OFELIA ELIZABETH OCHOA ROMERO"}]
["MODALIDAD :",null,null,null,null,null,null,null,{"$f":"MATRICULA!I12","v":"CONCENTRADO EDUCACIÓN SECUNDARIA"}]
[]
[]
["Promedio de Aprovechamiento de los Campos de Formación Académica",null,null,null,null,null,null,null,null,null,null,null,null,null,null,null,null,null,null,null,null,null,null,"Promedio de Aprovechamiento de las Áreas de Desarrollo Personal y Social"]
["Zona escolar","GRUPOS","Lengua Materna",null,null,"Matemáticas",null,null,"Inglés",null,null,"Ciencias y tecnología (Física)",null,null,"Historia ",null,null,"Formación Cívica y Ética",null,null,"Tecnología II",null,null,"Educación Física",null,null,"Artes",null,null,"Prom. Final"]
[null,null,"CALIF",null,null,"CALIF",null,null,"CALIF",null,null,"CALIF",null,null,"CALIF",null,null,"CALIF",null,null,"CALIF",null,null,"CALIF",null,null,"CALIF",null,null,"CALIF"]
[{"$f":"IF(MATRICULA!B18=0,\"\",MATRICULA!B18)","v":"Generales Públicas"},185,8.5,null,null,8.1999999999999993,null,null,8.6,null,null,8.3000000000000007,null,null,8.5,null,null,8.6,null,null,8.8000000000000007,null,null,9.5,null,null,8.6999999999999993,null,null,{"$f":"IFERROR(ROUND(AVERAGE(C17:AC17),1),\"\")","v":8.6}]
[{"$f":"IF(MATRICULA!B19=0,\"\",MATRICULA!B19)","v":"Particulares"},74,8.8000000000000007,null,null,8.5,null,null,8.8000000000000007,null,null,8.6999999999999993,null,null,8.9,null,null,9,null,null,9.1,null,null,9.6999999999999993,null,null,9.5,null,null,9]
[{"$f":"IF(MATRICULA!B20=0,\"\",MATRICULA!B20)","v":"Técnicas"},244,8.4,null,null,8,null,null,8.4,null,null,8.4,null,null,8.4,null,null,8.4,null,null,8.6,null,null,9.4,null,null,8.9,null,null,8.5]
[{"$f":"IF(MATRICULA!B21=0,\"\",MATRICULA!B21)","v":"Telesecundarias"},105,8.4,null,null,8.1,null,null,8.3000000000000007,null,null,8.1999999999999993,null,null,8.3000000000000007,null,null,8.6,null,null,9.1,null,null,9.1999999999999993,null,null,9.1,null,null,8.6]
[{"$f":"IF(MATRICULA!B22=0,\"\",MATRICULA!B22)","v":""},null,null,null,null,null,null,null,null,null,null,null,null,null,null,null,null,null,null,null,null,null,null,null,null,null,null,null,null,""]
[{"$f":"IF(MATRICULA!B23=0,\"\",MATRICULA!B23)","v":""},null,null,null,null,null,null,null,null,null,null,null,null,null,null,null,null,null,null,null,null,null,null,null,null,null,null,null,null,""]
[{"$f":"IF(MATRICULA!B24=0,\"\",MATRICULA!B24)","v":""},null,null,null,null,null,null,null,null,null,null,null,null,null,null,null,null,null,null,null,null,null,null,null,null,null,null,null,null,""]
[{"$f":"IF(MATRICULA!B25=0,\"\",MATRICULA!B25)","v":""},null,null,null,null,null,null,null,null,null,null,null,null,null,null,null,null,null,null,null,null,null,null,null,null,null,null,null,null,{"$f":"IFERROR(ROUND(AVERAGE(C24:AC24),1),\"\")","v":""}]
[{"$f":"IF(MATRICULA!B26=0,\"\",MATRICULA!B26)","v":""},null,null,null,null,null,null,null,null,null,null,null,null,null,null,null,null,null,null,null,null,null,null,null,null,null,null,null,null,""]
[{"$f":"IF(MATRICULA!B27=0,\"\",MATRICULA!B27)","v":""},null,null,null,null,null,null,null,null,null,null,null,null,null,null,null,null,null,null,null,null,null,null,null,null,null,null,null,null,""]
["Gral.",{"$f":"IF(SUM(B17:B25)=0,\"\",SUM(B17:B25))","v":608},{"$f":"IFERROR(ROUND(AVERAGE(C17:E26),1),\"\")","v":8.5},null,null,{"$f":"IFERROR(ROUND(AVERAGE(F17:H26),1),\"\")","v":8.1999999999999993},null,null,{"$f":"IFERROR(ROUND(AVERAGE(I17:K26),1),\"\")","v":8.5},null,null,{"$f":"IFERROR(ROUND(AVERAGE(L17:N26),1),\"\")","v":8.4},null,null,{"$f":"IFERROR(ROUND(AVERAGE(O17:Q26),1),\"\")","v":8.5},null,null,{"$f":"IFERROR(ROUND(AVERAGE(R17:T26),1),\"\")","v":8.6999999999999993},null,null,{"$f":"IFERROR(ROUND(AVERAGE(U17:W26),1),\"\")","v":8.9},null,null,{"$f":"IFERROR(ROUND(AVERAGE(X17:Z26),1),\"\")","v":9.5},null,null,{"$f":"IFERROR(ROUND(AVERAGE(AA17:AC26),1),\"\")","v":9.1},null,null,{"$f":"IFERROR(ROUND(AVERAGE(C27:AC27),1),\"\")","v":8.6999999999999993}]
[]
["Campos de Formación Académica en situacion de riesgo de no acreditar",null,null,null,null,null,null,null,null,null,null,null,null,null,null,null,null,null,null,null,null,null,null,"Áreas de Desarrollo Personal y Social en situación de riesgo de no acreditar"]
["Zona escolar",null,"Lengua Materna",null,null,"Matemáticas",null,null,"Inglés",null,null,"Ciencias y tecnología (Física)",null,null,"Historia ",null,null,"Formación Cívica y Ética",null,null,"Tecnología II",null,null,"Educación Física",null,null,"Artes",null,null,"Total"]
[null,null,5,6,"T",5,6,"T",5,6,"T",5,6,"T",5,6,"T",5,6,"T",5,6,"T",5,6,"T",5,6,"T",5,6]
[{"$f":"IF(MATRICULA!B18=0,\"\",MATRICULA!B18)","v":"Generales Públicas"},null,246,533,{"$f":"IF(SUM(C32,D32)=0,\"\",SUM(C32,D32))","v":779},343,559,{"$f":"IF(SUM(F32,G32)=0,\"\",SUM(F32,G32))","v":902},156,447,{"$f":"IF(SUM(I32,J32)=0,\"\",SUM(I32,J32))","v":603},306,590,{"$f":"IF(SUM(L32,M32)=0,\"\",SUM(L32,M32))","v":896},229,461,{"$f":"IF(SUM(O32,P32)=0,\"\",SUM(O32,P32))","v":690},131,372,{"$f":"IF(SUM(R32,S32)=0,\"\",SUM(R32,S32))","v":503},210,343,{"$f":"IF(SUM(U32,V32)=0,\"\",SUM(U32,V32))","v":553},57,76,{"$f":"IF(SUM(X32,Y32)=0,\"\",SUM(X32,Y32))","v":133},173,340,{"$f":"IF(SUM(AA32,AB32)=0,\"\",SUM(AA32,AB32))","v":513},{"$f":"IF(SUM(C32,F32,I32,L32,O32,R32,U32,X32,AA32)=0,\"\",SUM(C32,F32,I32,L32,O32,R32,U32,X32,AA32))","v":1851},{"$f":"IF(SUM(D32,G32,J32,M32,P32,S32,V32,Y32,AB32)=0,\"\",SUM(D32,G32,J32,M32,P32,S32,V32,Y32,AB32))","v":3721}]
[{"$f":"IF(MATRICULA!B19=0,\"\",MATRICULA!B19)","v":"Particulares"},null,10,27,37,30,68,98,7,41,48,42,63,105,6,23,29,2,50,52,19,45,64,6,13,19,9,21,30,131,351]
[{"$f":"IF(MATRICULA!B20=0,\"\",MATRICULA!B20)","v":"Técnicas"},null,272,440,712,303,644,947,266,409,675,204,536,740,281,534,815,229,508,737,218,429,647,59,88,147,200,312,512,2032,3900]
[{"$f":"IF(MATRICULA!B21=0,\"\",MATRICULA!B21)","v":"Telesecundarias"},null,44,129,173,59,172,231,58,136,194,54,174,228,53,149,202,57,98,155,45,64,109,20,21,41,31,48,79,421,991]
[{"$f":"IF(MATRICULA!B22=0,\"\",MATRICULA!B22)","v":""},null,null,null,"",null,null,"",null,null,"",null,null,"",null,null,"",null,null,"",null,null,"",null,null,"",null,null,"","",""]
[{"$f":"IF(MATRICULA!B23=0,\"\",MATRICULA!B23)","v":""},null,null,null,"",null,null,"",null,null,"",null,null,"",null,null,"",null,null,"",null,null,"",null,null,"",null,null,"","",""]
[{"$f":"IF(MATRICULA!B24=0,\"\",MATRICULA!B24)","v":""},null,null,null,"",null,null,"",null,null,"",null,null,"",null,null,"",null,null,"",null,null,"",null,null,"",null,null,"","",""]
[{"$f":"IF(MATRICULA!B25=0,\"\",MATRICULA!B25)","v":""},null,null,null,{"$f":"IF(SUM(C39,D39)=0,\"\",SUM(C39,D39))","v":""},null,null,{"$f":"IF(SUM(F39,G39)=0,\"\",SUM(F39,G39))","v":""},null,null,{"$f":"IF(SUM(I39,J39)=0,\"\",SUM(I39,J39))","v":""},null,null,{"$f":"IF(SUM(L39,M39)=0,\"\",SUM(L39,M39))","v":""},null,null,{"$f":"IF(SUM(O39,P39)=0,\"\",SUM(O39,P39))","v":""},null,null,{"$f":"IF(SUM(R39,S39)=0,\"\",SUM(R39,S39))","v":""},null,null,{"$f":"IF(SUM(U39,V39)=0,\"\",SUM(U39,V39))","v":""},null,null,{"$f":"IF(SUM(X39,Y39)=0,\"\",SUM(X39,Y39))","v":""},null,null,{"$f":"IF(SUM(AA39,AB39)=0,\"\",SUM(AA39,AB39))","v":""},{"$f":"IF(SUM(C39,F39,I39,L39,O39,R39,U39,X39,AA39)=0,\"\",SUM(C39,F39,I39,L39,O39,R39,U39,X39,AA39))","v":""},""]
[{"$f":"IF(MATRICULA!B26=0,\"\",MATRICULA!B26)","v":""},null,null,null,"",null,null,"",null,null,"",null,null,"",null,null,"",null,null,"",null,null,"",null,null,"",null,null,"","",""]
[{"$f":"IF(MATRICULA!B27=0,\"\",MATRICULA!B27)","v":""},null,null,null,"",null,null,"",null,null,"",null,null,"",null,null,"",null,null,"",null,null,"",null,null,"",null,null,"","",""]
["Total",null,{"$f":"IF(SUM(C32:C41)=0,\"\",SUM(C32:C41))","v":572},1129,1701,735,1443,2178,487,1033,1520,606,1363,1969,569,1167,1736,419,1028,1447,492,881,1373,142,198,340,413,721,1134,4435,8963]
[]
["Nota: Para las columnas \"Campos de Formación Académica y Áreas de Desarrollo Personal y Social en riesgo de no acreditar\" registre la cantidad de cincos o seis que existen en cada campo o área."]

{"sheet":"Gráfica APROV 2","index":4,"n_rows":13,"n_cols":14,"rows_kept":13,"cut":false,"hidden":false,"merged":[[6,1,6,12],[6,13,6,25],[0,0,0,32],[2,1,2,29],[3,1,3,29],[4,1,4,29],[5,1,5,12],[5,13,5,25],[8,0,8,7],[8,9,8,25],[9,26,9,30],[9,9,9,25],[9,0,9,7]]}
[]
[]
[null,"Secretaría de Educación Pública del Estado de Baja California Sur"]
[null,"Dirección de Educación Secundaria"]
[null,"SEGUNDO GRADO"]
[null,"PERIODO EVALUACIÓN:",null,null,null,null,null,null,null,null,null,null,null,{"$f":"MATRICULA!O7","v":"SEGUNDO PERIODO DE EVALUACIÓN"}]
[null,"CICLO ESCOLAR :",null,null,null,null,null,null,null,null,null,null,null,{"$f":"MATRICULA!O8","v":"2022-2023"}]
[]
["JEFE DE DEPARTAMENTO: ",null,null,null,null,null,null,null,null,{"$f":"MATRICULA!I11","v":"MTRA OFELIA ELIZABETH OCHOA ROMERO"}]
["MODALIDAD :",null,null,null,null,null,null,null,null,{"$f":"MATRICULA!I12","v":"CONCENTRADO EDUCACIÓN SECUNDARIA"}]
[]
[null,"Lengua Materna","Matemáticas","Inglés","Ciencias y tecnología (Física)","Historia ","Formación Cívica y Ética ","Tecnología II","Educación Física","Artes"]
[null,{"$f":"'APROV 2'!C27","v":8.5},{"$f":"'APROV 2'!F27","v":8.1999999999999993},{"$f":"'APROV 2'!I27","v":8.5},{"$f":"'APROV 2'!L27","v":8.4},{"$f":"'APROV 2'!O27","v":8.5},{"$f":"'APROV 2'!R27","v":8.6999999999999993},{"$f":"'APROV 2'!U27","v":8.9},{"$f":"'APROV 2'!X27","v":9.5},{"$f":"'APROV 2'!AA27","v":9.1}]

{"sheet":"APROV 3","index":5,"n_rows":42,"n_cols":31,"rows_kept":42,"cut":false,"hidden":false,"merged":[[36,0,36,1],[37,0,37,1],[38,0,38,1],[39,0,39,1],[40,0,40,1],[12,29,13,30],[28,0,29,1],[30,0,30,1],[31,0,31,1],[32,0,32,1],[33,0,33,1],[34,0,34,1],[35,0,35,1],[27,29,27,30],[28,26,28,28],[28,29,28,30],[25,29,25,30],[25,26,25,28],[13,26,13,28],[14,26,14,28],[22,26,22,28],[23,26,23,28],[24,26,24,28],[12,23,12,28],[41,0,42,30],[22,2,22,4],[23,2,23,4],[24,2,24,4],[14,5,14,7],[22,5,22,7],[23,5,23,7],[24,5,24,7],[23,17,23,19],[24,17,24,19],[14,11,14,13],[22,11,22,13],[23,11,23,13],[24,11,24,13],[21,29,21,30],[23,8,23,10],[24,8,24,10],[28,2,28,4],[28,5,28,7],[28,8,28,10],[28,11,28,13],[28,14,28,16],[22,17,22,19],[27,23,27,28],[14,29,14,30],[22,29,22,30],[23,29,23,30],[24,29,24,30],[15,29,15,30],[16,29,16,30],[17,29,17,30],[18,29,18,30],[19,29,19,30],[20,29,20,30],[25,14,25,16],[13,2,13,4],[13,5,13,7],[25,5,25,7],[25,2,25,4],[25,8,25,10],[14,8,14,10],[22,8,22,10],[15,5,15,7],[17,2,17,4],[17,5,17,7],[19,2,19,4],[19,5,19,7],[21,2,21,4],[21,5,21,7],[21,8,21,10],[21,11,21,13],[13,11,13,13],[14,2,14,4],[13,8,13,10],[10,0,10,7],[10,8,10,24],[22,14,22,16],[23,14,23,16],[13,0,14,0],[14,14,14,16],[24,14,24,16],[13,1,14,1],[11,5,11,11],[11,13,11,14],[16,23,16,25],[15,8,15,10],[15,11,15,13],[15,14,15,16],[15,17,15,19],[15,20,15,22],[15,23,15,25],[13,14,13,16],[13,17,13,19],[14,17,14,19],[17,20,17,22],[17,23,17,25],[28,17,28,19],[28,23,28,25],[13,23,13,25],[14,23,14,25],[22,23,22,25],[23,23,23,25],[24,23,24,25],[12,0,12,22],[28,20,28,22],[27,0,27,22],[13,20,13,22],[14,20,14,22],[22,20,22,22],[23,20,23,22],[24,20,24,22],[15,2,15,4],[21,17,21,19],[21,20,21,22],[19,8,19,10],[19,11,19,13],[25,17,25,19],[25,23,25,25],[25,11,25,13],[25,20,25,22],[2,2,2,27],[3,2,3,27],[5,2,5,27],[6,2,6,13],[7,2,7,13],[6,14,6,24],[4,2,4,27],[9,0,9,7],[9,8,9,24],[7,14,7,24],[15,26,15,28],[16,2,16,4],[16,5,16,7],[16,8,16,10],[16,11,16,13],[16,14,16,16],[16,17,16,19],[16,20,16,22],[21,14,21,16],[16,26,16,28],[17,26,17,28],[18,2,18,4],[18,5,18,7],[18,8,18,10],[18,11,18,13],[18,14,18,16],[18,17,18,19],[18,20,18,22],[18,23,18,25],[18,26,18,28],[17,8,17,10],[17,11,17,13],[17,14,17,16],[17,17,17,19],[21,26,21,28],[19,17,19,19],[19,20,19,22],[19,23,19,25],[19,26,19,28],[20,2,20,4],[20,5,20,7],[20,8,20,10],[20,11,20,13],[20,14,20,16],[20,17,20,19],[20,20,20,22],[20,23,20,25],[20,26,20,28],[21,23,21,25],[19,14,19,16]]}
[]
[]
[null,null,"Secretaría de Educación Pública del Estado de Baja California Sur"]
[null,null,"Dirección de Educación Secundaria"]
[null,null,"APROVECHAMIENTO Y RIESGO DE NO ACREDITAR"]
[null,null,"TERCER GRADO"]
[null,null,"PERIODO EVALUACIÓN:",null,null,null,null,null,null,null,null,null,null,null,{"$f":"IF('APROV 1'!O7:AA7<>0,'APROV 1'!O7:AA7, \"\")","v":"SEGUNDO PERIODO DE EVALUACIÓN"}]
[null,null,"CICLO ESCOLAR :",null,null,null,null,null,null,null,null,null,null,null,{"$f":"IF('APROV 1'!O8:AA8<>0, 'APROV 1'!O8:AA8, \"\")","v":"2022-2023"}]
[]
["JEFE DE DEPARTAMENTO: ",null,null,null,null,null,null,null,{"$f":"MATRICULA!I11","v":"MTRA OFELIA ELIZABETH OCHOA ROMERO"}]
["MODALIDAD :",null,null,null,null,null,null,null,{"$f":"MATRICULA!I12","v":"CONCENTRADO EDUCACIÓN SECUNDARIA"}]
[]
["Promedio de Aprovechamiento de los Campos de Formación Académica",null,null,null,null,null,null,null,null,null,null,null,null,null,null,null,null,null,null,null,null,null,null,"Promedio de Aprovechamiento de las Áreas de Desarrollo Personal y Social",null,null,null,null,null,"Prom. Final"]
["Zona escolar","GRUPOS","Español III",null,null,"Matemáticas III",null,null,"Segunda Lengua: Inglés III",null,null,"Ciencias III (Énfasis en Química)",null,null,"Historia II",null,null,"Formación Cívica y Ética II",null,null,"Tecnología III",null,null,"Educación Física III",null,null,"Artes III"]
[null,null,"CALIF",null,null,"CALIF",null,null,"CALIF",null,null,"CALIF",null,null,"CALIF",null,null,"CALIF",null,null,"CALIF",null,null,"CALIF",null,null,"CALIF",null,null,"CALIF"]
[{"$f":"IF(MATRICULA!B18=0,\"\",MATRICULA!B18)","v":"Generales Públicas"},185,8.5,null,null,8.1999999999999993,null,null,8.6,null,null,8.3000000000000007,null,null,8.5,null,null,8.6,null,null,8.8000000000000007,null,null,9.5,null,null,8.6999999999999993,null,null,{"$f":"IFERROR(ROUND(AVERAGE(C16:AC16),1),\"\")","v":8.6}]
[{"$f":"IF(MATRICULA!B19=0,\"\",MATRICULA!B19)","v":"Particulares"},70,8.6999999999999993,null,null,8.6,null,null,8.6,null,null,8.6999999999999993,null,null,8.9,null,null,9.1,null,null,9.3000000000000007,null,null,9.6999999999999993,null,null,9.5,null,null,9]
[{"$f":"IF(MATRICULA!B20=0,\"\",MATRICULA!B20)","v":"Técnicas"},242,8.5,null,null,8.1999999999999993,null,null,8.5,null,null,8.3000000000000007,null,null,8.4,null,null,8.5,null,null,8.6999999999999993,null,null,9.4,null,null,8.9,null,null,8.6]
[{"$f":"IF(MATRICULA!B21=0,\"\",MATRICULA!B21)","v":"Telesecundarias"},100,8.3000000000000007,null,null,8.1,null,null,8.4,null,null,8.1999999999999993,null,null,8.4,null,null,8.6999999999999993,null,null,8.9,null,null,9.1,null,null,9.1,null,null,8.6]
[{"$f":"IF(MATRICULA!B22=0,\"\",MATRICULA!B22)","v":""},null,null,null,null,null,null,null,null,null,null,null,null,null,null,null,null,null,null,null,null,null,null,null,null,null,null,null,null,""]
[{"$f":"IF(MATRICULA!B23=0,\"\",MATRICULA!B23)","v":""},null,null,null,null,null,null,null,null,null,null,null,null,null,null,null,null,null,null,null,null,null,null,null,null,null,null,null,null,""]
[{"$f":"IF(MATRICULA!B24=0,\"\",MATRICULA!B24)","v":""},null,null,null,null,null,null,null,null,null,null,null,null,null,null,null,null,null,null,null,null,null,null,null,null,null,null,null,null,""]
[{"$f":"IF(MATRICULA!B25=0,\"\",MATRICULA!B25)","v":""},null,null,null,null,null,null,null,null,null,null,null,null,null,null,null,null,null,null,null,null,null,null,null,null,null,null,null,null,{"$f":"IFERROR(ROUND(AVERAGE(C23:AC23),1),\"\")","v":""}]
[{"$f":"IF(MATRICULA!B26=0,\"\",MATRICULA!B26)","v":""},null,null,null,null,null,null,null,null,null,null,null,null,null,null,null,null,null,null,null,null,null,null,null,null,null,null,null,null,""]
[{"$f":"IF(MATRICULA!B27=0,\"\",MATRICULA!B27)","v":""},null,null,null,null,null,null,null,null,null,null,null,null,null,null,null,null,null,null,null,null,null,null,null,null,null,null,null,null,""]
["Gral.",{"$f":"IF(SUM(B16:B24)=0,\"\",SUM(B16:B24))","v":597},{"$f":"IFERROR(ROUND(AVERAGE(C16:E25),1),\"\")","v":8.5},null,null,{"$f":"IFERROR(ROUND(AVERAGE(F16:H25),1),\"\")","v":8.3000000000000007},null,null,{"$f":"IFERROR(ROUND(AVERAGE(I16:K25),1),\"\")","v":8.5},null,null,{"$f":"IFERROR(ROUND(AVERAGE(L16:N25),1),\"\")","v":8.4},null,null,{"$f":"IFERROR(ROUND(AVERAGE(O16:Q25),1),\"\")","v":8.6},null,null,{"$f":"IFERROR(ROUND(AVERAGE(R16:T25),1),\"\")","v":8.6999999999999993},null,null,{"$f":"IFERROR(ROUND(AVERAGE(U16:W25),1),\"\")","v":8.9},null,null,{"$f":"IFERROR(ROUND(AVERAGE(X16:Z25),1),\"\")","v":9.4},null,null,{"$f":"IFERROR(ROUND(AVERAGE(AA16:AC25),1),\"\")","v":9.1},null,null,{"$f":"IFERROR(ROUND(AVERAGE(C26:AC26),1),\"\")","v":8.6999999999999993}]
[]
["Campos de Formación Académica en situacion de riesgo de no acreditar",null,null,null,null,null,null,null,null,null,null,null,null,null,null,null,null,null,null,null,null,null,null,"Áreas de Desarrollo Personal y Social en situación de riesgo de no acreditar"]
["Zona escolar",null,"Español III",null,null,"Matemáticas III",null,null,"Segunda Lengua: Inglés III",null,null,"Ciencias III (Énfasis en Química)",null,null,"Historia II",null,null,"Formación Cívica y Ética II",null,null,"Tecnología III",null,null,"Educación Física III",null,null,"Artes III",null,null,"Total"]
[null,null,5,6,"T",5,6,"T",5,6,"T",5,6,"T",5,6,"T",5,6,"T",5,6,"T",5,6,"T",5,6,"T",5,6]
[{"$f":"IF(MATRICULA!B18=0,\"\",MATRICULA!B18)","v":"Generales Públicas"},null,246,533,{"$f":"IF(SUM(C31,D31)=0,\"\",SUM(C31,D31))","v":779},343,559,{"$f":"IF(SUM(F31,G31)=0,\"\",SUM(F31,G31))","v":902},156,447,{"$f":"IF(SUM(I31,J31)=0,\"\",SUM(I31,J31))","v":603},306,590,{"$f":"IF(SUM(L31,M31)=0,\"\",SUM(L31,M31))","v":896},229,461,{"$f":"IF(SUM(O31,P31)=0,\"\",SUM(O31,P31))","v":690},131,372,{"$f":"IF(SUM(R31,S31)=0,\"\",SUM(R31,S31))","v":503},210,343,{"$f":"IF(SUM(U31,V31)=0,\"\",SUM(U31,V31))","v":553},57,76,{"$f":"IF(SUM(X31,Y31)=0,\"\",SUM(X31,Y31))","v":133},173,340,{"$f":"IF(SUM(AA31,AB31)=0,\"\",SUM(AA31,AB31))","v":513},{"$f":"IF(SUM(C31,F31,I31,L31,O31,R31,U31,X31,AA31)=0,\"\",SUM(C31,F31,I31,L31,O31,R31,U31,X31,AA31))","v":1851},{"$f":"IF(SUM(D31,G31,J31,M31,P31,S31,V31,Y31,AB31)=0,\"\",SUM(D31,G31,J31,M31,P31,S31,V31,Y31,AB31))","v":3721}]
[{"$f":"IF(MATRICULA!B19=0,\"\",MATRICULA!B19)","v":"Particulares"},null,13,39,52,38,70,108,23,44,67,16,48,64,10,43,53,13,41,54,20,33,53,7,7,14,5,20,25,145,345]
[{"$f":"IF(MATRICULA!B20=0,\"\",MATRICULA!B20)","v":"Técnicas"},null,266,313,579,277,473,750,259,313,572,324,541,865,222,440,662,225,447,672,256,317,573,43,76,119,136,299,435,2008,3219]
[{"$f":"IF(MATRICULA!B21=0,\"\",MATRICULA!B21)","v":"Telesecundarias"},null,31,96,127,40,107,147,45,67,112,51,92,143,41,86,127,31,76,107,31,55,86,18,17,35,37,57,94,325,653]
[{"$f":"IF(MATRICULA!B22=0,\"\",MATRICULA!B22)","v":""},null,null,null,"",null,null,"",null,null,"",null,null,"",null,null,"",null,null,"",null,null,"",null,null,"",null,null,"","",""]
[{"$f":"IF(MATRICULA!B23=0,\"\",MATRICULA!B23)","v":""},null,null,null,"",null,null,"",null,null,"",null,null,"",null,null,"",null,null,"",null,null,"",null,null,"",null,null,"","",""]
[{"$f":"IF(MATRICULA!B24=0,\"\",MATRICULA!B24)","v":""},null,null,null,"",null,null,"",null,null,"",null,null,"",null,null,"",null,null,"",null,null,"",null,null,"",null,null,"","",""]
[{"$f":"IF(MATRICULA!B25=0,\"\",MATRICULA!B25)","v":""},null,null,null,{"$f":"IF(SUM(C38,D38)=0,\"\",SUM(C38,D38))","v":""},null,null,{"$f":"IF(SUM(F38,G38)=0,\"\",SUM(F38,G38))","v":""},null,null,{"$f":"IF(SUM(I38,J38)=0,\"\",SUM(I38,J38))","v":""},null,null,{"$f":"IF(SUM(L38,M38)=0,\"\",SUM(L38,M38))","v":""},null,null,{"$f":"IF(SUM(O38,P38)=0,\"\",SUM(O38,P38))","v":""},null,null,{"$f":"IF(SUM(R38,S38)=0,\"\",SUM(R38,S38))","v":""},null,null,{"$f":"IF(SUM(U38,V38)=0,\"\",SUM(U38,V38))","v":""},null,null,{"$f":"IF(SUM(X38,Y38)=0,\"\",SUM(X38,Y38))","v":""},null,null,{"$f":"IF(SUM(AA38,AB38)=0,\"\",SUM(AA38,AB38))","v":""},{"$f":"IF(SUM(C38,F38,I38,L38,O38,R38,U38,X38,AA38)=0,\"\",SUM(C38,F38,I38,L38,O38,R38,U38,X38,AA38))","v":""},""]
[{"$f":"IF(MATRICULA!B26=0,\"\",MATRICULA!B26)","v":""},null,null,null,"",null,null,"",null,null,"",null,null,"",null,null,"",null,null,"",null,null,"",null,null,"",null,null,"","",""]
[{"$f":"IF(MATRICULA!B27=0,\"\",MATRICULA!B27)","v":""},null,null,null,"",null,null,"",null,null,"",null,null,"",null,null,"",null,null,"",null,null,"",null,null,"",null,null,"","",""]
["Total",null,{"$f":"IF(SUM(C31:C40)=0,\"\",SUM(C31:C40))","v":556},981,1537,698,1209,1907,483,871,1354,697,1271,1968,502,1030,1532,400,936,1336,517,748,1265,125,176,301,351,716,1067,4329,7938]
["Nota: Para las columnas \"Campos de Formación Académica y Áreas de Desarrollo Personal y Social en riesgo de no acreditar\" registre la cantidad de cincos o seis que existen en cada campo o área."]

{"sheet":"Gráfica APROV 3","index":6,"n_rows":13,"n_cols":14,"rows_kept":13,"cut":false,"hidden":false,"merged":[[6,13,6,23],[0,0,0,32],[2,1,2,29],[3,1,3,29],[4,1,4,29],[5,1,5,12],[6,1,6,12],[5,13,5,26],[9,26,9,30],[8,0,8,7],[9,0,9,8],[9,9,9,24],[8,9,8,24]]}
[]
[]
[null,"Secretaría de Educación Pública del Estado de Baja California Sur"]
[null,"Dirección de Educación Secundaria"]
[null,"TERCER GRADO"]
[null,"PERIODO EVALUACIÓN:",null,null,null,null,null,null,null,null,null,null,null,{"$f":"MATRICULA!O7","v":"SEGUNDO PERIODO DE EVALUACIÓN"}]
[null,"CICLO ESCOLAR :",null,null,null,null,null,null,null,null,null,null,null,{"$f":"MATRICULA!O8","v":"2022-2023"}]
[]
["JEFE DE DEPARTAMENTO: ",null,null,null,null,null,null,null,null,{"$f":"MATRICULA!I11","v":"MTRA OFELIA ELIZABETH OCHOA ROMERO"}]
["MODALIDAD :",null,null,null,null,null,null,null,null,{"$f":"MATRICULA!I12","v":"CONCENTRADO EDUCACIÓN SECUNDARIA"}]
[]
[null,"Español III","Matemáticas III","Segunda Lengua: Inglés III","Ciencias III (Énfasis en Química)","Historia II","Formación Cívica y Ética II","Tecnología III","Educación Física III","Artes III"]
[null,{"$f":"'APROV 3'!C26","v":8.5},{"$f":"'APROV 3'!F26","v":8.3000000000000007},{"$f":"'APROV 3'!I26","v":8.5},{"$f":"'APROV 3'!L26","v":8.4},{"$f":"'APROV 3'!O26","v":8.6},{"$f":"'APROV 3'!R26","v":8.6999999999999993},{"$f":"'APROV 3'!U26","v":8.9},{"$f":"'APROV 3'!X26","v":9.4},{"$f":"'APROV 3'!AA26","v":9.1}]

{"sheet":"Gráfica Promedios Finales","index":7,"n_rows":15,"n_cols":14,"rows_kept":15,"cut":false,"hidden":false,"merged":[[0,0,0,31],[2,1,2,29],[3,1,3,29],[4,1,4,12],[5,1,5,12],[5,13,5,25],[25,0,105,31],[8,0,8,6],[8,8,8,25],[7,0,7,7],[7,8,7,25]]}
[]
[]
[null,"Secretaría de Educación Pública del Estado de Baja California Sur"]
[null,"Dirección de Educación Secundaria"]
[null,"PERIODO DE EVALUACIÓN:",null,null,null,null,null,null,null,null,null,null,null,{"$f":"MATRICULA!O7","v":"SEGUNDO PERIODO DE EVALUACIÓN"}]
[null,"CICLO ESCOLAR :",null,null,null,null,null,null,null,null,null,null,null,{"$f":"MATRICULA!O8","v":"2022-2023"}]
[]
["JEFE DE DEPARTAMENTO: ",null,null,null,null,null,null,null,{"$f":"MATRICULA!I11","v":"MTRA OFELIA ELIZABETH OCHOA ROMERO"}]
["MODALIDAD :",null,null,null,null,null,null,null,{"$f":"MATRICULA!I12","v":"CONCENTRADO EDUCACIÓN SECUNDARIA"}]
[]
[]
[]
[]
[null,"PROMEDIO 1RO","PROMEDIO 2DO","PROMEDIO 3ERO"]
[null,{"$f":"+'APROV 1'!AG26","v":8.6},{"$f":"+'APROV 2'!AD27","v":8.6999999999999993},{"$f":"'APROV 3'!AD26","v":8.6999999999999993}]

{"sheet":"NORMALIDAD MÍNIMA","index":8,"n_rows":60,"n_cols":18,"rows_kept":60,"cut":false,"hidden":false,"merged":[[61,0,77,17],[52,0,52,17],[60,0,60,17],[53,0,53,10],[57,0,57,10],[57,11,57,16],[55,11,55,16],[59,0,59,10],[56,0,56,10],[58,0,58,10],[58,11,58,16],[56,11,56,16],[54,0,54,10],[54,11,54,16],[55,0,55,10],[9,0,9,4],[9,6,9,14],[2,1,2,16],[3,1,3,16],[4,1,4,16],[5,1,5,9],[6,1,6,8],[5,10,5,14],[6,10,6,14],[39,1,39,5],[39,6,39,8],[39,9,40,9],[11,9,12,9],[25,10,25,12],[39,10,39,12],[25,1,37,5],[25,6,25,8],[25,9,26,9],[11,1,11,2],[11,3,11,4],[40,1,40,2],[39,13,39,14],[39,15,39,16],[53,11,53,16],[8,0,8,5],[8,6,8,14],[38,0,38,17],[11,15,11,16],[24,0,24,17],[11,10,11,12],[11,13,11,14],[11,0,12,0],[11,6,11,8],[25,13,25,14],[25,15,25,16],[25,0,26,0],[39,0,40,0],[49,1,49,2],[50,1,50,2],[41,1,41,2],[42,1,42,2],[43,1,43,2],[44,1,44,2],[45,1,45,2],[51,1,51,2],[40,3,40,4],[41,3,41,4],[42,3,42,4],[43,3,43,4],[44,3,44,4],[45,3,45,4],[46,3,46,4],[47,3,47,4],[48,3,48,4],[49,3,49,4],[50,3,50,4],[51,3,51,4],[46,1,46,2],[47,1,47,2],[48,1,48,2]]}
[]
[]
[null,"Secretaría de Educación Pública del Estado de Baja California Sur"]
[null,"Dirección de Educación Secundaria"]
[null,"NORMALIDAD MÍNIMA"]
[null,"PERIODO DE EVALUACIÓN:",null,null,null,null,null,null,null,null,{"$f":"IF('APROV 1'!O7<>0,'APROV 1'!O7, \"\")","v":"SEGUNDO PERIODO DE EVALUACIÓN"}]
[null,"CICLO ESCOLAR :",null,null,null,null,null,null,null,null,{"$f":"IF('APROV 1'!O8<>0, 'APROV 1'!O8, \"\")","v":"2022-2023"}]
[]
["JEFE DE DEPARTAMENTO: ",null,null,null,null,null,{"$f":"MATRICULA!I11","v":"MTRA OFELIA ELIZABETH OCHOA ROMERO"}]
["MODALIDAD :",null,null,null,null,null,{"$f":"MATRICULA!I12","v":"CONCENTRADO EDUCACIÓN SECUNDARIA"}]
[]
["Zona escolar","DIRECTIVOS\nDirectores",null,"DIRECTIVOS\nSubdirectores",null,null,"COORDINADORES",null,null,"R","INASISTENCIAS",null,null,"LICENCIAS ECONÓMICAS",null,"LICENCIAS MÉDICAS",null,"TOTAL DE DÍAS NO LABORADOS"]
[null,"H","M","H","M","T","H","M","T",null,"I ","P.D.","D.N.L.I y P.D.","L.E."," D.N.L.E.","L.M.","D.N.L.M.","DNLI y PD, DNLE, DNLM"]
[{"$f":"IF(MATRICULA!B18=0,\"\",MATRICULA!B18)","v":"Generales Públicas"},33,11,18,20,{"$f":"IF(SUM(B14:E14)=0,\"\",SUM(B14:E14))","v":82},17,16,{"$f":"IF(SUM(G14,H14)=0,\"\",SUM(G14,H14))","v":33},null,1,30,{"$f":"IF(SUM(K14,L14)=0,\"\",SUM(K14,L14))","v":31},34,70,32,240,{"$f":"IF(SUM(M14,O14,Q14)=0,\"\",SUM(M14,O14,Q14))","v":341}]
[{"$f":"IF(MATRICULA!B19=0,\"\",MATRICULA!B19)","v":"Particulares"},null,null,null,null,{"$f":"IF(SUM(B15:E15)=0,\"\",SUM(B15:E15))","v":""},null,null,{"$f":"IF(SUM(G15,H15)=0,\"\",SUM(G15,H15))","v":""},null,null,null,{"$f":"IF(SUM(K15,L15)=0,\"\",SUM(K15,L15))","v":""},null,null,null,null,""]
[{"$f":"IF(MATRICULA!B20=0,\"\",MATRICULA!B20)","v":"Técnicas"},20,14,20,9,63,28,21,49,null,1,3,4,33,73,72,115,192]
[{"$f":"IF(MATRICULA!B21=0,\"\",MATRICULA!B21)","v":"Telesecundarias"},17,6,10,3,36,null,null,"",null,null,43,43,20,46,2,10,99]
[{"$f":"IF(MATRICULA!B22=0,\"\",MATRICULA!B22)","v":""},null,null,null,null,"",null,null,"",null,null,null,"",null,null,null,null,""]
[{"$f":"IF(MATRICULA!B23=0,\"\",MATRICULA!B23)","v":""},null,null,null,null,"",null,null,"",null,null,null,"",null,null,null,null,""]
[{"$f":"IF(MATRICULA!B24=0,\"\",MATRICULA!B24)","v":""},null,null,null,null,"",null,null,"",null,null,null,"",null,null,null,null,""]
[{"$f":"IF(MATRICULA!B25=0,\"\",MATRICULA!B25)","v":""},null,null,null,null,"",null,null,"",null,null,null,"",null,null,null,null,""]
[{"$f":"IF(MATRICULA!B26=0,\"\",MATRICULA!B26)","v":""},null,null,null,null,"",null,null,"",null,null,null,"",null,null,null,null,""]
[{"$f":"IF(MATRICULA!B27=0,\"\",MATRICULA!B27)","v":""},null,null,null,null,{"$f":"IF(SUM(B23,E23)=0,\"\",SUM(B23,E23))","v":""},null,null,"",null,null,null,"",null,null,null,null,""]
["Total",{"$f":"IF(SUM(B14:B23)=0,\"\",SUM(B14:B23))","v":70},{"$f":"IF(SUM(C14:C22)=0,\"\",SUM(C14:C22))","v":31},{"$f":"IF(SUM(D14:D22)=0,\"\",SUM(D14:D22))","v":48},32,181,45,37,82,"",2,76,78,87,189,106,365,632]
[]
["Zona escolar","PERSONAL  POR HORAS ",null,null,null,null,"DOCENTES",null,null,"R","INASISTENCIAS (Horas)",null,null,"LICENCIAS ECONÓMICAS",null,"LICENCIAS MÉDICAS",null,"TOTAL DE HORAS NO LABORADOS"]
[null,null,null,null,null,null,"F","E","T",null,"I ","P.D.","H.N.L.I y P.D.","L.E."," H.N.L.E.","L.M.","H.N.L.M.","HNLI y PD, HNLE, HNLM"]
[{"$f":"IF(MATRICULA!B18=0,\"\",MATRICULA!B18)","v":"Generales Públicas"},null,null,null,null,null,977,102,{"$f":"IF(SUM(G28,H28)=0,\"\",SUM(G28,H28))","v":1079},332,2910,624,{"$f":"IF(SUM(K28,L28)=0,\"\",SUM(K28,L28))","v":3534},889,6101,597,5135,{"$f":"IF(SUM(M28,O28,Q28)=0,\"\",SUM(M28,O28,Q28))","v":14770}]
[{"$f":"IF(MATRICULA!B19=0,\"\",MATRICULA!B19)","v":"Particulares"},null,null,null,null,null,null,null,"",null,null,null,{"$f":"IF(SUM(K29,L29)=0,\"\",SUM(K29,L29))","v":""},null,null,null,null,""]
[{"$f":"IF(MATRICULA!B20=0,\"\",MATRICULA!B20)","v":"Técnicas"},null,null,null,null,null,722,150,872,480,1221,675,1896,452,4858,269,3497,10251]
[{"$f":"IF(MATRICULA!B21=0,\"\",MATRICULA!B21)","v":"Telesecundarias"},null,null,null,null,null,224,51,275,null,6,null,6,180,787,90,513,1306]
[{"$f":"IF(MATRICULA!B22=0,\"\",MATRICULA!B22)","v":""},null,null,null,null,null,null,null,"",null,null,null,"",null,null,null,null,""]
[{"$f":"IF(MATRICULA!B23=0,\"\",MATRICULA!B23)","v":""},null,null,null,null,null,null,null,"",null,null,null,"",null,null,null,null,""]
[{"$f":"IF(MATRICULA!B24=0,\"\",MATRICULA!B24)","v":""},null,null,null,null,null,null,null,"",null,null,null,"",null,null,null,null,""]
[{"$f":"IF(MATRICULA!B25=0,\"\",MATRICULA!B25)","v":""},null,null,null,null,null,null,null,"",null,null,null,"",null,null,null,null,""]
[{"$f":"IF(MATRICULA!B26=0,\"\",MATRICULA!B26)","v":""},null,null,null,null,null,null,null,"",null,null,null,"",null,null,null,null,""]
[{"$f":"IF(MATRICULA!B27=0,\"\",MATRICULA!B27)","v":""},null,null,null,null,null,null,null,"",null,null,null,"",null,null,null,null,""]
["Total",null,null,null,null,null,{"$f":"IF(SUM(G28:G37)=0,\"\",SUM(G28:G37))","v":1923},303,2226,812,4137,1299,5436,1521,11746,956,9145,26327]
[]
["Zona escolar","ASISTENCIA EDUCATIVA\n(Psicólogos, trabajo social, médicos, prefectos)",null,null,null,null,"ADMINISTRATIVO Y DE APOYO",null,null,"R","INASISTENCIAS",null,null,"LICENCIAS ECONÓMICAS",null,"LICENCIAS MÉDICAS",null,"TOTAL DE DÍAS NO LABORADOS"]
[null,"F",null,"E",null,"T","F","E","T",null,"I ","P.D.","D.N.L.I y P.D.","L.E."," D.N.L.E.","L.M.","D.N.L.M.","DNLI y PD, DNLE, DNLM"]
[{"$f":"IF(MATRICULA!B18=0,\"\",MATRICULA!B18)","v":"Generales Públicas"},175,null,38,null,{"$f":"IF(SUM(B42:E42)=0,\"\",SUM(B42:E42))","v":213},291,167,{"$f":"IF(SUM(G42,H42)=0,\"\",SUM(G42,H42))","v":458},219,260,41,{"$f":"IF(SUM(K42,L42)=0,\"\",SUM(K42,L42))","v":301},367,1021,180,721,{"$f":"IF(SUM(M42,O42,Q42)=0,\"\",SUM(M42,O42,Q42))","v":2043}]
[{"$f":"IF(MATRICULA!B19=0,\"\",MATRICULA!B19)","v":"Particulares"},null,null,null,null,{"$f":"IF(SUM(B43:E43)=0,\"\",SUM(B43:E43))","v":""},null,null,"",null,null,null,"",null,null,null,null,""]
[{"$f":"IF(MATRICULA!B20=0,\"\",MATRICULA!B20)","v":"Técnicas"},122,null,55,null,177,206,112,318,271,218,90,308,250,638,150,707,1653]
[{"$f":"IF(MATRICULA!B21=0,\"\",MATRICULA!B21)","v":"Telesecundarias"},11,null,7,null,18,44,88,132,59,51,66,117,62,204,108,267,588]
[{"$f":"IF(MATRICULA!B22=0,\"\",MATRICULA!B22)","v":""},null,null,null,null,"",null,null,"",null,null,null,"",null,null,null,null,""]
[{"$f":"IF(MATRICULA!B23=0,\"\",MATRICULA!B23)","v":""},null,null,null,null,"",null,null,"",null,null,null,"",null,null,null,null,""]
[{"$f":"IF(MATRICULA!B24=0,\"\",MATRICULA!B24)","v":""},null,null,null,null,"",null,null,"",null,null,null,"",null,null,null,null,""]
[{"$f":"IF(MATRICULA!B25=0,\"\",MATRICULA!B25)","v":""},null,null,null,null,"",null,null,"",null,null,null,"",null,null,null,null,""]
[{"$f":"IF(MATRICULA!B26=0,\"\",MATRICULA!B26)","v":""},null,null,null,null,"",null,null,"",null,null,null,"",null,null,null,null,""]
[{"$f":"IF(MATRICULA!B27=0,\"\",MATRICULA!B27)","v":""},null,null,null,null,"",null,null,"",null,null,null,"",null,null,null,null,""]
["Total",{"$f":"IF(SUM(B42:B51)=0,\"\",SUM(B42:B51))","v":308},null,100,null,{"$f":"IF(SUM(F42:F51)=0,\"\",SUM(F42:F51))","v":408},541,367,908,549,529,197,726,679,1863,438,1695,4284]
[]
["NOTA:",null,null,null,null,null,null,null,null,null,null,"NOTA:"]
["I.: INASISTENCIAS",null,null,null,null,null,null,null,null,null,null,"H.N.L.E.: HORAS NO LABORADOS POR LICENCIAS ECONÓMICAS"]
["H.N.L.I.: HORAS NO LABORADAS POR INASISTENCIAS",null,null,null,null,null,null,null,null,null,null,"D.N.L.E.:  DÍAS NO LABORADOS POR LICENCIAS ECONÓMICAS"]
["D.N.L.I.: DÍAS NO LABORADOS POR INASISTENCIAS",null,null,null,null,null,null,null,null,null,null,"L.M.: PERSONAS QUE PRESENTARON LICENCIAS MÉDICAS"]
["R. :  CANTIDAD DE RETARDOS",null,null,null,null,null,null,null,null,null,null,"H.N.L.M.: HORAS NO LABORADAS POR LICENCIAS MÉDICAS"]
["L.E.:   PERSONAL QUE SOLICITÓ LICENCIAS ECONÓMICAS",null,null,null,null,null,null,null,null,null,null,"D.N.L.M.: DÍAS NO LABORADOS POR LICENCIAS MÉDICAS"]
["P.D.: PERMISOS DIRECCIÓN",null,null,null,null,null,null,null,null,null,null,"F: FONE     E: EVENTUALES"]

{"sheet":"Hoja1","index":9,"n_rows":10,"n_cols":3,"rows_kept":10,"cut":false,"hidden":true,"merged":[]}
[]
[]
[null,null,"PRIMER PERIODO DE EVALUACIÓN"]
[null,null,"SEGUNDO PERIODO DE EVALUACIÓN"]
[null,null,"TERCER PERIODO DE EVALUACIÓN"]
[null,null,"CIERRE DE CICLO ESCOLAR 2022-2023"]
[]
[]
[null,null,"SECUNDARIAS GENERALES PÚBLICAS"]
[null,null,"SECUNDARIAS GENERALES PARTICULARES"]